Share

No Title

Public

11 October 2018

Views: 17

$ stack setup -v
Version 1.7.1, Git revision 681c800873816c022739ca7ed14755e85a579565 (5807 commits) x86_64 hpack-0.28.2
2018-10-11 15:26:34.523615: [debug] Checking for project config at: /home/leon/stack.yaml
@(src/Stack/Config.hs:850:9)
2018-10-11 15:26:34.524547: [debug] Checking for project config at: /home/stack.yaml
@(src/Stack/Config.hs:850:9)
2018-10-11 15:26:34.524680: [debug] Checking for project config at: /stack.yaml
@(src/Stack/Config.hs:850:9)
2018-10-11 15:26:34.524804: [debug] No project config file found, using defaults.
@(src/Stack/Config.hs:880:13)
2018-10-11 15:26:34.527250: [debug] Run from outside a project, using implicit global project config
@(src/Stack/Config.hs:570:13)
2018-10-11 15:26:34.527981: [debug] Using resolver: lts-12.12 from implicit global project's config file: /home/leon/.stack/global-project/stack.yaml
@(src/Stack/Config.hs:584:32)
2018-10-11 15:26:34.528213: [debug] Decoding build plan from: /home/leon/.stack/build-plan/lts-12.12.yaml
@(src/Stack/Snapshot.hs:164:5)
2018-10-11 15:26:34.528339: [debug] Trying to decode /home/leon/.stack/build-plan-cache/lts-12.12.cache
@(src/Stack/Snapshot.hs:156:32)
2018-10-11 15:26:34.537768: [debug] Success decoding /home/leon/.stack/build-plan-cache/lts-12.12.cache
@(src/Stack/Snapshot.hs:156:32)
2018-10-11 15:26:34.538074: [debug] Run process: /sbin/ldconfig -p
@(src/Stack/Setup.hs:580:22)
2018-10-11 15:26:34.539595: [debug] Process finished in 1ms: /sbin/ldconfig -p
@(src/Stack/Setup.hs:580:22)
2018-10-11 15:26:34.540088: [debug] Did not find shared library libtinfo.so.5
@(src/Stack/Setup.hs:603:38)
2018-10-11 15:26:34.540266: [debug] Did not find shared library libtinfo.so.6
@(src/Stack/Setup.hs:603:38)
2018-10-11 15:26:34.540388: [debug] Found shared library libncursesw.so.6 in 'ldconfig -p' output
@(src/Stack/Setup.hs:589:29)
2018-10-11 15:26:34.540528: [debug] Found shared library libgmp.so.10 in 'ldconfig -p' output
@(src/Stack/Setup.hs:589:29)
2018-10-11 15:26:34.540698: [debug] Did not find shared library libgmp.so.3
@(src/Stack/Setup.hs:603:38)
2018-10-11 15:26:34.540805: [debug] Potential GHC builds: ncurses6
@(src/Stack/Setup.hs:632:9)
2018-10-11 15:26:34.540961: [debug] Found already installed GHC builds:
@(src/Stack/Setup.hs:458:13)
2018-10-11 15:26:34.867884: [debug] Trying to setup GHC build: ncurses6
@(src/Stack/Setup.hs:956:9)
2018-10-11 15:26:34.868026: [info] Preparing to install GHC (ncurses6) to an isolated location.
@(src/Stack/Setup.hs:890:5)
2018-10-11 15:26:34.868081: [info] This will not interfere with any system-level installation.
@(src/Stack/Setup.hs:899:5)
2018-10-11 15:26:34.869286: [debug] Downloading from https://github.com/commercialhaskell/ghc/releases/download/ghc-8.4.3-release/ghc-8.4.3-x86_64-fedora27-linux.tar.xz to /home/leon/.stack/programs/x86_64-linux/ghc-ncurses6-8.4.3.tar.xz ...
@(src/Stack/Setup.hs:1525:5)
2018-10-11 15:26:34.870211: [debug] Will check against sha1 hash: 8d4328ebfd10c08c9b8e221df27c54e5d035017c
@(src/Stack/Setup.hs:1538:13)
2018-10-11 15:26:34.870638: [debug] Will check against sha256 hash: 269e7a4d3f336491b88409a020998122b30a3a729af78d33be86d3b3f8000c3e
@(src/Stack/Setup.hs:1538:13)
2018-10-11 15:26:36.033239: [info] Already downloaded.
@(src/Stack/Setup.hs:1557:14)
2018-10-11 15:26:36.134270: [debug] menv = fromList [("COLORTERM","truecolor"),("DESKTOP_STARTUP_ID","awesome/alacritty/846-27-LTpT430_TIME5105437"),("DISPLAY",":0"),("HOME","/home/leon"),("LANG","en_GB.UTF-8"),("LC_COLLATE","C"),("LOGNAME","leon"),("LS_COLORS","no=00:fi=00:di=01;34:ln=01;36:pi=40;33:so=01;35:do=01;35:bd=40;33;01:cd=40;33;01:or=40;31;01:mi=01;05;37;41:su=37;41:sg=30;43:ca=30;41:tw=30;42:ow=34;42:st=37;44:ex=01;32:*.tar=01;31:*.tgz=01;31:*.svgz=01;31:*.arj=01;31:*.taz=01;31:*.lzh=01;31:*.lzma=01;31:*.zip=01;31:*.z=01;31:*.Z=01;31:*.dz=01;31:*.gz=01;31:*.bz2=01;31:*.tbz2=01;31:*.bz=01;31:*.tz=01;31:*.deb=01;31:*.rpm=01;31:*.jar=01;31:*.rar=01;31:*.ace=01;31:*.zoo=01;31:*.cpio=01;31:*.7z=01;31:*.rz=01;31:*.jpg=01;35:*.jpeg=01;35:*.gif=01;35:*.bmp=01;35:*.pbm=01;35:*.pgm=01;35:*.ppm=01;35:*.tga=01;35:*.xbm=01;35:*.xpm=01;35:*.tif=01;35:*.tiff=01;35:*.png=01;35:*.mng=01;35:*.pcx=01;35:*.mov=01;35:*.mpg=01;35:*.mpeg=01;35:*.m2v=01;35:*.mkv=01;35:*.ogm=01;35:*.mp4=01;35:*.m4v=01;35:*.mp4v=01;35:*.vob=01;35:*.qt=01;35:*.nuv=01;35:*.wmv=01;35:*.asf=01;35:*.rm=01;35:*.rmvb=01;35:*.flc=01;35:*.avi=01;35:*.fli=01;35:*.gl=01;35:*.dl=01;35:*.xcf=01;35:*.xwd=01;35:*.yuv=01;35:*.svg=01;35:*.aac=00;36:*.au=00;36:*.flac=00;36:*.mid=00;36:*.midi=00;36:*.mka=00;36:*.mp3=00;36:*.mpc=00;36:*.ogg=00;36:*.ra=00;36:*.wav=00;36:"),("MAIL","/var/spool/mail/leon"),("MOZ_PLUGIN_PATH","/usr/lib/mozilla/plugins"),("PATH","/home/leon/.local/bin:/home/leon/.local/bin:/usr/local/sbin:/usr/local/bin:/usr/bin:/usr/sbin:/sbin:/bin"),("PWD","/home/leon"),("SHELL","/bin/bash"),("SHLVL","2"),("TERM","xterm-256color"),("USER","leon"),("WINDOWID","48234499"),("WINDOWPATH","7"),("XAUTHORITY","/home/leon/.Xauthority"),("XDG_RUNTIME_DIR","/run/user/1000"),("XDG_SESSION_COOKIE","LTpT430-1539258237.303152-936409722"),("_","/usr/local/bin/stack")]
@(src/Stack/Setup.hs:1067:5)
2018-10-11 15:26:36.134702: [debug] ziptool: xz
@(src/Stack/Setup.hs:1085:5)
2018-10-11 15:26:36.134772: [debug] make: make
@(src/Stack/Setup.hs:1086:5)
2018-10-11 15:26:36.134834: [debug] tar: tar
@(src/Stack/Setup.hs:1087:5)
2018-10-11 15:26:36.134933: [debug] Unpacking /home/leon/.stack/programs/x86_64-linux/ghc-ncurses6-8.4.3.tar.xz
@(src/Stack/Setup.hs:1123:5)
2018-10-11 15:26:36.135516: [debug] Run process within /home/leon/.stack/programs/x86_64-linux/ghc-ncurses6-8.4.3.temp/: /usr/bin/tar Jxf /home/leon/.stack/programs/x86_64-linux/ghc-ncurses6-8.4.3.tar.xz
@(src/Stack/Prelude.hs:96:3)
2018-10-11 15:26:52.627695: [debug] Process finished in 16492ms: /usr/bin/tar Jxf /home/leon/.stack/programs/x86_64-linux/ghc-ncurses6-8.4.3.tar.xz
@(src/Stack/Prelude.hs:96:3)
2018-10-11 15:26:52.628229: [debug] Run process within /home/leon/.stack/programs/x86_64-linux/ghc-ncurses6-8.4.3.temp/ghc-8.4.3/: /home/leon/.stack/programs/x86_64-linux/ghc-ncurses6-8.4.3.temp/ghc-8.4.3/configure --prefix=/home/leon/.stack/programs/x86_64-linux/ghc-ncurses6-8.4.3/
@(src/Stack/Prelude.hs:96:3)
2018-10-11 15:26:52.753504: [debug] checking build system type... x86_64-pc-linux-gnu
@(src/Stack/Setup.hs:1097:54)
2018-10-11 15:26:52.753733: [debug] checking host system type... x86_64-pc-linux-gnu
@(src/Stack/Setup.hs:1097:54)
2018-10-11 15:26:52.754050: [debug] checking target system type... x86_64-pc-linux-gnu
@(src/Stack/Setup.hs:1097:54)
2018-10-11 15:26:52.754440: [debug] Build platform inferred as: x86_64-unknown-linux
@(src/Stack/Setup.hs:1097:54)
2018-10-11 15:26:52.762221: [debug] Host platform inferred as: x86_64-unknown-linux
@(src/Stack/Setup.hs:1097:54)
2018-10-11 15:26:52.767055: [debug] Target platform inferred as: x86_64-unknown-linux
@(src/Stack/Setup.hs:1097:54)
2018-10-11 15:26:52.796810: [debug] GHC build : x86_64-unknown-linux
@(src/Stack/Setup.hs:1097:54)
2018-10-11 15:26:52.797750: [debug] GHC host : x86_64-unknown-linux
@(src/Stack/Setup.hs:1097:54)
2018-10-11 15:26:52.798085: [debug] GHC target : x86_64-unknown-linux
@(src/Stack/Setup.hs:1097:54)
2018-10-11 15:26:52.798289: [debug] LLVM target: x86_64-unknown-linux
@(src/Stack/Setup.hs:1097:54)
2018-10-11 15:26:52.800383: [debug] checking for path to top of build tree... /home/leon/.stack/programs/x86_64-linux/ghc-ncurses6-8.4.3.temp/ghc-8.4.3
@(src/Stack/Setup.hs:1097:54)
2018-10-11 15:26:52.800720: [debug] checking for perl... /usr/bin/perl
@(src/Stack/Setup.hs:1097:54)
2018-10-11 15:26:52.811963: [debug] checking for a BSD-compatible install... /usr/bin/install -c
@(src/Stack/Setup.hs:1097:54)
2018-10-11 15:26:52.812361: [debug] checking for gfind... /usr/bin/gfind
@(src/Stack/Setup.hs:1097:54)
2018-10-11 15:26:52.820729: [debug] checking whether ln -s works... yes
@(src/Stack/Setup.hs:1097:54)
2018-10-11 15:26:52.821305: [debug] checking for gsed... sed
@(src/Stack/Setup.hs:1097:54)
2018-10-11 15:26:52.821717: [debug] checking for gcc... gcc
@(src/Stack/Setup.hs:1097:54)
2018-10-11 15:26:52.907740: [debug] checking whether the C compiler works... yes
@(src/Stack/Setup.hs:1097:54)
2018-10-11 15:26:52.907999: [debug] checking for C compiler default output file name... a.out
@(src/Stack/Setup.hs:1097:54)
2018-10-11 15:26:52.954674: [debug] checking for suffix of executables...
@(src/Stack/Setup.hs:1097:54)
2018-10-11 15:26:53.002433: [debug] checking whether we are cross compiling... no
@(src/Stack/Setup.hs:1097:54)
2018-10-11 15:26:53.036152: [debug] checking for suffix of object files... o
@(src/Stack/Setup.hs:1097:54)
2018-10-11 15:26:53.065557: [debug] checking whether we are using the GNU C compiler... yes
@(src/Stack/Setup.hs:1097:54)
2018-10-11 15:26:53.096940: [debug] checking whether gcc accepts -g... yes
@(src/Stack/Setup.hs:1097:54)
2018-10-11 15:26:53.143455: [debug] checking for gcc option to accept ISO C89... none needed
@(src/Stack/Setup.hs:1097:54)
2018-10-11 15:26:53.171312: [debug] checking how to run the C preprocessor... gcc -E
@(src/Stack/Setup.hs:1097:54)
2018-10-11 15:26:53.272919: [debug] checking for gcc option to accept ISO C99... none needed
@(src/Stack/Setup.hs:1097:54)
2018-10-11 15:26:53.318069: [debug] checking for gcc option to accept ISO C99... none needed
@(src/Stack/Setup.hs:1097:54)
2018-10-11 15:26:53.365090: [debug] checking for gcc option to accept ISO C99... none needed
@(src/Stack/Setup.hs:1097:54)
2018-10-11 15:26:53.366437: [debug] checking for -ld.lld... no
@(src/Stack/Setup.hs:1097:54)
2018-10-11 15:26:53.366724: [debug] checking for ld.lld... no
@(src/Stack/Setup.hs:1097:54)
2018-10-11 15:26:53.366855: [debug] checking for -ld.gold... no
@(src/Stack/Setup.hs:1097:54)
2018-10-11 15:26:53.366983: [debug] checking for ld.gold... ld.gold
@(src/Stack/Setup.hs:1097:54)
2018-10-11 15:26:53.454645: [debug] checking whether C compiler supports -fuse-ld=gold... yes
@(src/Stack/Setup.hs:1097:54)
2018-10-11 15:26:53.458935: [debug] checking whether ld is GNU ld... YES
@(src/Stack/Setup.hs:1097:54)
2018-10-11 15:26:53.486424: [debug] checking whether ld understands --build-id... yes
@(src/Stack/Setup.hs:1097:54)
2018-10-11 15:26:53.515021: [debug] checking whether ld understands -no_compact_unwind... yes
@(src/Stack/Setup.hs:1097:54)
2018-10-11 15:26:53.573574: [debug] checking whether ld understands -filelist... no
@(src/Stack/Setup.hs:1097:54)
2018-10-11 15:26:53.573810: [debug] checking for -strip... no
@(src/Stack/Setup.hs:1097:54)
2018-10-11 15:26:53.574060: [debug] checking for strip... strip
@(src/Stack/Setup.hs:1097:54)
2018-10-11 15:26:53.574330: [debug] checking for llc-5.0... no
@(src/Stack/Setup.hs:1097:54)
2018-10-11 15:26:53.574420: [debug] checking for llc... no
@(src/Stack/Setup.hs:1097:54)
2018-10-11 15:26:53.574648: [debug] checking for opt-5.0... no
@(src/Stack/Setup.hs:1097:54)
2018-10-11 15:26:53.574734: [debug] checking for opt... no
@(src/Stack/Setup.hs:1097:54)
2018-10-11 15:26:53.576744: [debug] checking version of gcc... 8.2.0
@(src/Stack/Setup.hs:1097:54)
2018-10-11 15:26:53.585366: [debug] checking whether GCC supports -no-pie... yes
@(src/Stack/Setup.hs:1097:54)
2018-10-11 15:26:53.587256: [debug] checking for extra options to pass gcc when compiling via C... -fwrapv -fno-builtin
@(src/Stack/Setup.hs:1097:54)
2018-10-11 15:26:53.611550: [debug] checking Setting up CFLAGS, LDFLAGS, IGNORE_LINKER_LD_FLAGS and CPPFLAGS... done
@(src/Stack/Setup.hs:1097:54)
2018-10-11 15:26:53.637290: [debug] checking Setting up CONF_CC_OPTS_STAGE0, CONF_GCC_LINKER_OPTS_STAGE0, CONF_LD_LINKER_OPTS_STAGE0 and CONF_CPP_OPTS_STAGE0... done
@(src/Stack/Setup.hs:1097:54)
2018-10-11 15:26:53.659202: [debug] checking Setting up CONF_CC_OPTS_STAGE1, CONF_GCC_LINKER_OPTS_STAGE1, CONF_LD_LINKER_OPTS_STAGE1 and CONF_CPP_OPTS_STAGE1... done
@(src/Stack/Setup.hs:1097:54)
2018-10-11 15:26:53.681957: [debug] checking Setting up CONF_CC_OPTS_STAGE2, CONF_GCC_LINKER_OPTS_STAGE2, CONF_LD_LINKER_OPTS_STAGE2 and CONF_CPP_OPTS_STAGE2... done
@(src/Stack/Setup.hs:1097:54)
2018-10-11 15:26:53.717590: [debug] checking for .subsections_via_symbols... no
@(src/Stack/Setup.hs:1097:54)
2018-10-11 15:26:53.739325: [debug] checking whether your assembler supports .ident directive... yes
@(src/Stack/Setup.hs:1097:54)
2018-10-11 15:26:53.771748: [debug] checking for GNU non-executable stack support... yes
@(src/Stack/Setup.hs:1097:54)
2018-10-11 15:26:53.775914: [debug] checking for grep that handles long lines and -e... /usr/bin/grep
@(src/Stack/Setup.hs:1097:54)
2018-10-11 15:26:53.777359: [debug] checking for egrep... /usr/bin/grep -E
@(src/Stack/Setup.hs:1097:54)
2018-10-11 15:26:53.924330: [debug] checking for ANSI C header files... yes
@(src/Stack/Setup.hs:1097:54)
2018-10-11 15:26:53.961088: [debug] checking for sys/types.h... yes
@(src/Stack/Setup.hs:1097:54)
2018-10-11 15:26:54.002052: [debug] checking for sys/stat.h... yes
@(src/Stack/Setup.hs:1097:54)
2018-10-11 15:26:54.039043: [debug] checking for stdlib.h... yes
@(src/Stack/Setup.hs:1097:54)
2018-10-11 15:26:54.077904: [debug] checking for string.h... yes
@(src/Stack/Setup.hs:1097:54)
2018-10-11 15:26:54.123245: [debug] checking for memory.h... yes
@(src/Stack/Setup.hs:1097:54)
2018-10-11 15:26:54.172732: [debug] checking for strings.h... yes
@(src/Stack/Setup.hs:1097:54)
2018-10-11 15:26:54.217912: [debug] checking for inttypes.h... yes
@(src/Stack/Setup.hs:1097:54)
2018-10-11 15:26:54.262609: [debug] checking for stdint.h... yes
@(src/Stack/Setup.hs:1097:54)
2018-10-11 15:26:54.309053: [debug] checking for unistd.h... yes
@(src/Stack/Setup.hs:1097:54)
2018-10-11 15:26:54.393538: [debug] checking size of void *... 8
@(src/Stack/Setup.hs:1097:54)
2018-10-11 15:26:54.394751: [debug] checking for -ar... no
@(src/Stack/Setup.hs:1097:54)
2018-10-11 15:26:54.394890: [debug] checking for ar... ar
@(src/Stack/Setup.hs:1097:54)
2018-10-11 15:26:54.399424: [debug] checking whether ar is GNU ar... yes
@(src/Stack/Setup.hs:1097:54)
2018-10-11 15:26:54.403022: [debug] checking for ar arguments... q
@(src/Stack/Setup.hs:1097:54)
2018-10-11 15:26:54.411548: [debug] checking whether ar supports @file... yes
@(src/Stack/Setup.hs:1097:54)
2018-10-11 15:26:54.412925: [debug] checking for ranlib... ranlib
@(src/Stack/Setup.hs:1097:54)
2018-10-11 15:26:54.428960: [debug] configure: creating ./config.status
@(src/Stack/Setup.hs:1097:54)
2018-10-11 15:26:54.518070: [debug] config.status: creating settings
@(src/Stack/Setup.hs:1097:54)
2018-10-11 15:26:54.531567: [debug] config.status: creating mk/config.mk
@(src/Stack/Setup.hs:1097:54)
2018-10-11 15:26:54.549953: [debug] config.status: creating mk/install.mk
@(src/Stack/Setup.hs:1097:54)
2018-10-11 15:26:54.568934: [debug] ****************************************************
@(src/Stack/Setup.hs:1097:54)
2018-10-11 15:26:54.569148: [debug] Configuration done, ready to 'make install'
@(src/Stack/Setup.hs:1097:54)
2018-10-11 15:26:54.569330: [debug] (see README and INSTALL files for more info.)
@(src/Stack/Setup.hs:1097:54)
2018-10-11 15:26:54.569496: [debug] ****************************************************
@(src/Stack/Setup.hs:1097:54)
2018-10-11 15:26:54.582607: [debug] Process finished in 1954ms: /home/leon/.stack/programs/x86_64-linux/ghc-ncurses6-8.4.3.temp/ghc-8.4.3/configure --prefix=/home/leon/.stack/programs/x86_64-linux/ghc-ncurses6-8.4.3/
@(src/Stack/Prelude.hs:96:3)
2018-10-11 15:26:54.583060: [debug] Run process within /home/leon/.stack/programs/x86_64-linux/ghc-ncurses6-8.4.3.temp/ghc-8.4.3/: /usr/bin/make install
@(src/Stack/Prelude.hs:96:3)
2018-10-11 15:26:54.585874: [debug] /usr/bin/make --no-print-directory -f ghc.mk install BINDIST=YES NO_INCLUDE_DEPS=YES
@(src/Stack/Setup.hs:1097:54)
2018-10-11 15:26:55.073750: [debug] "rm" -f utils/ghc-pkg/dist-install/build/Version.hs
@(src/Stack/Setup.hs:1097:54)
2018-10-11 15:26:55.075275: [debug] echo "module Version where" >> utils/ghc-pkg/dist-install/build/Version.hs
@(src/Stack/Setup.hs:1097:54)
2018-10-11 15:26:55.076071: [debug] echo "version, targetOS, targetARCH :: String" >> utils/ghc-pkg/dist-install/build/Version.hs
@(src/Stack/Setup.hs:1097:54)
2018-10-11 15:26:55.077066: [debug] echo "version = "8.4.3"" >> utils/ghc-pkg/dist-install/build/Version.hs
@(src/Stack/Setup.hs:1097:54)
2018-10-11 15:26:55.077589: [debug] echo "targetOS = "linux"" >> utils/ghc-pkg/dist-install/build/Version.hs
@(src/Stack/Setup.hs:1097:54)
2018-10-11 15:26:55.078294: [debug] echo "targetARCH = "x86_64"" >> utils/ghc-pkg/dist-install/build/Version.hs
@(src/Stack/Setup.hs:1097:54)
2018-10-11 15:26:55.079414: [debug] "rm" -f utils/ghc-pkg/dist/build/Version.hs
@(src/Stack/Setup.hs:1097:54)
2018-10-11 15:26:55.081428: [debug] echo "module Version where" >> utils/ghc-pkg/dist/build/Version.hs
@(src/Stack/Setup.hs:1097:54)
2018-10-11 15:26:55.082045: [debug] echo "version, targetOS, targetARCH :: String" >> utils/ghc-pkg/dist/build/Version.hs
@(src/Stack/Setup.hs:1097:54)
2018-10-11 15:26:55.082910: [debug] echo "version = "8.4.3"" >> utils/ghc-pkg/dist/build/Version.hs
@(src/Stack/Setup.hs:1097:54)
2018-10-11 15:26:55.083717: [debug] echo "targetOS = "linux"" >> utils/ghc-pkg/dist/build/Version.hs
@(src/Stack/Setup.hs:1097:54)
2018-10-11 15:26:55.084373: [debug] echo "targetARCH = "x86_64"" >> utils/ghc-pkg/dist/build/Version.hs
@(src/Stack/Setup.hs:1097:54)
2018-10-11 15:26:55.087728: [debug] /usr/bin/install -c -m 755 -d "/home/leon/.stack/programs/x86_64-linux/ghc-ncurses6-8.4.3/bin"
@(src/Stack/Setup.hs:1097:54)
2018-10-11 15:26:55.090776: [debug] "rm" -f "/home/leon/.stack/programs/x86_64-linux/ghc-ncurses6-8.4.3/bin/hp2ps"
@(src/Stack/Setup.hs:1097:54)
2018-10-11 15:26:55.092790: [debug] create () { touch "$1" && chmod 755 "$1" ; } && create "/home/leon/.stack/programs/x86_64-linux/ghc-ncurses6-8.4.3/bin/hp2ps"
@(src/Stack/Setup.hs:1097:54)
2018-10-11 15:26:55.095375: [debug] echo '#!/bin/sh' >> "/home/leon/.stack/programs/x86_64-linux/ghc-ncurses6-8.4.3/bin/hp2ps"
@(src/Stack/Setup.hs:1097:54)
2018-10-11 15:26:55.096432: [debug] echo 'exedir="/home/leon/.stack/programs/x86_64-linux/ghc-ncurses6-8.4.3/lib/ghc-8.4.3/bin"' >> "/home/leon/.stack/programs/x86_64-linux/ghc-ncurses6-8.4.3/bin/hp2ps"
@(src/Stack/Setup.hs:1097:54)
2018-10-11 15:26:55.097298: [debug] echo 'exeprog="hp2ps"' >> "/home/leon/.stack/programs/x86_64-linux/ghc-ncurses6-8.4.3/bin/hp2ps"
@(src/Stack/Setup.hs:1097:54)
2018-10-11 15:26:55.097861: [debug] echo 'executablename="$exedir/$exeprog"' >> "/home/leon/.stack/programs/x86_64-linux/ghc-ncurses6-8.4.3/bin/hp2ps"
@(src/Stack/Setup.hs:1097:54)
2018-10-11 15:26:55.098500: [debug] echo 'datadir="/home/leon/.stack/programs/x86_64-linux/ghc-ncurses6-8.4.3/share"' >> "/home/leon/.stack/programs/x86_64-linux/ghc-ncurses6-8.4.3/bin/hp2ps"
@(src/Stack/Setup.hs:1097:54)
2018-10-11 15:26:55.099527: [debug] echo 'bindir="/home/leon/.stack/programs/x86_64-linux/ghc-ncurses6-8.4.3/bin"' >> "/home/leon/.stack/programs/x86_64-linux/ghc-ncurses6-8.4.3/bin/hp2ps"
@(src/Stack/Setup.hs:1097:54)
2018-10-11 15:26:55.101091: [debug] echo 'topdir="/home/leon/.stack/programs/x86_64-linux/ghc-ncurses6-8.4.3/lib/ghc-8.4.3"' >> "/home/leon/.stack/programs/x86_64-linux/ghc-ncurses6-8.4.3/bin/hp2ps"
@(src/Stack/Setup.hs:1097:54)
2018-10-11 15:26:55.101884: [debug] cat utils/hp2ps/hp2ps.wrapper >> "/home/leon/.stack/programs/x86_64-linux/ghc-ncurses6-8.4.3/bin/hp2ps"
@(src/Stack/Setup.hs:1097:54)
2018-10-11 15:26:55.104745: [debug] chmod +x "/home/leon/.stack/programs/x86_64-linux/ghc-ncurses6-8.4.3/bin/hp2ps"
@(src/Stack/Setup.hs:1097:54)
2018-10-11 15:26:55.107023: [debug] /usr/bin/install -c -m 755 -d "/home/leon/.stack/programs/x86_64-linux/ghc-ncurses6-8.4.3/bin"
@(src/Stack/Setup.hs:1097:54)
2018-10-11 15:26:55.109592: [debug] "rm" -f "/home/leon/.stack/programs/x86_64-linux/ghc-ncurses6-8.4.3/bin/ghci-8.4.3"
@(src/Stack/Setup.hs:1097:54)
2018-10-11 15:26:55.111767: [debug] create () { touch "$1" && chmod 755 "$1" ; } && create "/home/leon/.stack/programs/x86_64-linux/ghc-ncurses6-8.4.3/bin/ghci-8.4.3"
@(src/Stack/Setup.hs:1097:54)
2018-10-11 15:26:55.114390: [debug] echo '#!/bin/sh' >> "/home/leon/.stack/programs/x86_64-linux/ghc-ncurses6-8.4.3/bin/ghci-8.4.3"
@(src/Stack/Setup.hs:1097:54)
2018-10-11 15:26:55.115494: [debug] echo 'exec "/home/leon/.stack/programs/x86_64-linux/ghc-ncurses6-8.4.3/bin/ghc-8.4.3" --interactive "$@"' >> "/home/leon/.stack/programs/x86_64-linux/ghc-ncurses6-8.4.3/bin/ghci-8.4.3"
@(src/Stack/Setup.hs:1097:54)
2018-10-11 15:26:55.117014: [debug] chmod +x "/home/leon/.stack/programs/x86_64-linux/ghc-ncurses6-8.4.3/bin/ghci-8.4.3"
@(src/Stack/Setup.hs:1097:54)
2018-10-11 15:26:55.119885: [debug] "rm" -f "/home/leon/.stack/programs/x86_64-linux/ghc-ncurses6-8.4.3/bin/ghci"
@(src/Stack/Setup.hs:1097:54)
2018-10-11 15:26:55.121845: [debug] ln -s ghci-8.4.3 "/home/leon/.stack/programs/x86_64-linux/ghc-ncurses6-8.4.3/bin/ghci"
@(src/Stack/Setup.hs:1097:54)
2018-10-11 15:26:55.123808: [debug] /usr/bin/install -c -m 755 -d "/home/leon/.stack/programs/x86_64-linux/ghc-ncurses6-8.4.3/lib/ghc-8.4.3/include"
@(src/Stack/Setup.hs:1097:54)
2018-10-11 15:26:55.126780: [debug] /usr/bin/install -c -m 755 -d "/home/leon/.stack/programs/x86_64-linux/ghc-ncurses6-8.4.3/lib/ghc-8.4.3/include/." && /usr/bin/install -c -m 644 includes/./*.h "/home/leon/.stack/programs/x86_64-linux/ghc-ncurses6-8.4.3/lib/ghc-8.4.3/include/./" && /usr/bin/install -c -m 755 -d "/home/leon/.stack/programs/x86_64-linux/ghc-ncurses6-8.4.3/lib/ghc-8.4.3/include/rts" && /usr/bin/install -c -m 644 includes/rts/*.h "/home/leon/.stack/programs/x86_64-linux/ghc-ncurses6-8.4.3/lib/ghc-8.4.3/include/rts/" && /usr/bin/install -c -m 755 -d "/home/leon/.stack/programs/x86_64-linux/ghc-ncurses6-8.4.3/lib/ghc-8.4.3/include/rts/prof" && /usr/bin/install -c -m 644 includes/rts/prof/*.h "/home/leon/.stack/programs/x86_64-linux/ghc-ncurses6-8.4.3/lib/ghc-8.4.3/include/rts/prof/" && /usr/bin/install -c -m 755 -d "/home/leon/.stack/programs/x86_64-linux/ghc-ncurses6-8.4.3/lib/ghc-8.4.3/include/rts/storage" && /usr/bin/install -c -m 644 includes/rts/storage/*.h "/home/leon/.stack/programs/x86_64-linux/ghc-ncurses6-8.4.3/lib/ghc-8.4.3/include/rts/storage/" && /usr/bin/install -c -m 755 -d "/home/leon/.stack/programs/x86_64-linux/ghc-ncurses6-8.4.3/lib/ghc-8.4.3/include/stg" && /usr/bin/install -c -m 644 includes/stg/*.h "/home/leon/.stack/programs/x86_64-linux/ghc-ncurses6-8.4.3/lib/ghc-8.4.3/include/stg/" && true
@(src/Stack/Setup.hs:1097:54)
2018-10-11 15:26:55.164370: [debug] /usr/bin/install -c -m 644 includes/ghcautoconf.h includes/ghcplatform.h includes/ghcversion.h includes/dist-derivedconstants/header/DerivedConstants.h "/home/leon/.stack/programs/x86_64-linux/ghc-ncurses6-8.4.3/lib/ghc-8.4.3/include/"
@(src/Stack/Setup.hs:1097:54)
2018-10-11 15:26:55.167191: [debug] /usr/bin/install -c -m 755 -d "/home/leon/.stack/programs/x86_64-linux/ghc-ncurses6-8.4.3/lib/ghc-8.4.3/include"
@(src/Stack/Setup.hs:1097:54)
2018-10-11 15:26:55.169735: [debug] /usr/bin/install -c -m 644 rts/dist/build/ffi.h rts/dist/build/ffitarget.h "/home/leon/.stack/programs/x86_64-linux/ghc-ncurses6-8.4.3/lib/ghc-8.4.3/include/"
@(src/Stack/Setup.hs:1097:54)
2018-10-11 15:26:55.171920: [debug] /usr/bin/install -c -m 755 -d "/home/leon/.stack/programs/x86_64-linux/ghc-ncurses6-8.4.3/bin"
@(src/Stack/Setup.hs:1097:54)
2018-10-11 15:26:55.174066: [debug] "rm" -f "/home/leon/.stack/programs/x86_64-linux/ghc-ncurses6-8.4.3/bin/haddock-ghc-8.4.3"
@(src/Stack/Setup.hs:1097:54)
2018-10-11 15:26:55.175524: [debug] create () { touch "$1" && chmod 755 "$1" ; } && create "/home/leon/.stack/programs/x86_64-linux/ghc-ncurses6-8.4.3/bin/haddock-ghc-8.4.3"
@(src/Stack/Setup.hs:1097:54)
2018-10-11 15:26:55.178364: [debug] echo '#!/bin/sh' >> "/home/leon/.stack/programs/x86_64-linux/ghc-ncurses6-8.4.3/bin/haddock-ghc-8.4.3"
@(src/Stack/Setup.hs:1097:54)
2018-10-11 15:26:55.179439: [debug] echo 'exedir="/home/leon/.stack/programs/x86_64-linux/ghc-ncurses6-8.4.3/lib/ghc-8.4.3/bin"' >> "/home/leon/.stack/programs/x86_64-linux/ghc-ncurses6-8.4.3/bin/haddock-ghc-8.4.3"
@(src/Stack/Setup.hs:1097:54)
2018-10-11 15:26:55.180300: [debug] echo 'exeprog="haddock"' >> "/home/leon/.stack/programs/x86_64-linux/ghc-ncurses6-8.4.3/bin/haddock-ghc-8.4.3"
@(src/Stack/Setup.hs:1097:54)
2018-10-11 15:26:55.181200: [debug] echo 'executablename="$exedir/$exeprog"' >> "/home/leon/.stack/programs/x86_64-linux/ghc-ncurses6-8.4.3/bin/haddock-ghc-8.4.3"
@(src/Stack/Setup.hs:1097:54)
2018-10-11 15:26:55.182023: [debug] echo 'datadir="/home/leon/.stack/programs/x86_64-linux/ghc-ncurses6-8.4.3/share"' >> "/home/leon/.stack/programs/x86_64-linux/ghc-ncurses6-8.4.3/bin/haddock-ghc-8.4.3"
@(src/Stack/Setup.hs:1097:54)
2018-10-11 15:26:55.183460: [debug] echo 'bindir="/home/leon/.stack/programs/x86_64-linux/ghc-ncurses6-8.4.3/bin"' >> "/home/leon/.stack/programs/x86_64-linux/ghc-ncurses6-8.4.3/bin/haddock-ghc-8.4.3"
@(src/Stack/Setup.hs:1097:54)
2018-10-11 15:26:55.184445: [debug] echo 'topdir="/home/leon/.stack/programs/x86_64-linux/ghc-ncurses6-8.4.3/lib/ghc-8.4.3"' >> "/home/leon/.stack/programs/x86_64-linux/ghc-ncurses6-8.4.3/bin/haddock-ghc-8.4.3"
@(src/Stack/Setup.hs:1097:54)
2018-10-11 15:26:55.185504: [debug] cat utils/haddock/haddock.wrapper >> "/home/leon/.stack/programs/x86_64-linux/ghc-ncurses6-8.4.3/bin/haddock-ghc-8.4.3"
@(src/Stack/Setup.hs:1097:54)
2018-10-11 15:26:55.187735: [debug] chmod +x "/home/leon/.stack/programs/x86_64-linux/ghc-ncurses6-8.4.3/bin/haddock-ghc-8.4.3"
@(src/Stack/Setup.hs:1097:54)
2018-10-11 15:26:55.190084: [debug] /usr/bin/install -c -m 755 -d "/home/leon/.stack/programs/x86_64-linux/ghc-ncurses6-8.4.3/lib/ghc-8.4.3/html/"
@(src/Stack/Setup.hs:1097:54)
2018-10-11 15:26:55.192898: [debug] /usr/bin/install -c -m 755 -d "/home/leon/.stack/programs/x86_64-linux/ghc-ncurses6-8.4.3/lib/ghc-8.4.3/html/Classic.theme/"
@(src/Stack/Setup.hs:1097:54)
2018-10-11 15:26:55.195043: [debug] /usr/bin/install -c -m 755 -d "/home/leon/.stack/programs/x86_64-linux/ghc-ncurses6-8.4.3/lib/ghc-8.4.3/html/Ocean.std-theme/"
@(src/Stack/Setup.hs:1097:54)
2018-10-11 15:26:55.197356: [debug] /usr/bin/install -c -m 755 -d "/home/leon/.stack/programs/x86_64-linux/ghc-ncurses6-8.4.3/lib/ghc-8.4.3/latex/"
@(src/Stack/Setup.hs:1097:54)
2018-10-11 15:26:55.199746: [debug] /usr/bin/install -c -m 644 utils/haddock/haddock-api/resources/html/quick-jump.min.js "/home/leon/.stack/programs/x86_64-linux/ghc-ncurses6-8.4.3/lib/ghc-8.4.3/html/"
@(src/Stack/Setup.hs:1097:54)
2018-10-11 15:26:55.203336: [debug] /usr/bin/install -c -m 644 utils/haddock/haddock-api/resources/html/quick-jump.css "/home/leon/.stack/programs/x86_64-linux/ghc-ncurses6-8.4.3/lib/ghc-8.4.3/html/"
@(src/Stack/Setup.hs:1097:54)
2018-10-11 15:26:55.206050: [debug] /usr/bin/install -c -m 644 utils/haddock/haddock-api/resources/html/haddock-bundle.min.js "/home/leon/.stack/programs/x86_64-linux/ghc-ncurses6-8.4.3/lib/ghc-8.4.3/html/"
@(src/Stack/Setup.hs:1097:54)
2018-10-11 15:26:55.208501: [debug] /usr/bin/install -c -m 644 utils/haddock/haddock-api/resources/html/Classic.theme/haskell_icon.gif "/home/leon/.stack/programs/x86_64-linux/ghc-ncurses6-8.4.3/lib/ghc-8.4.3/html/Classic.theme/"
@(src/Stack/Setup.hs:1097:54)
2018-10-11 15:26:55.211007: [debug] /usr/bin/install -c -m 644 utils/haddock/haddock-api/resources/html/Classic.theme/minus.gif "/home/leon/.stack/programs/x86_64-linux/ghc-ncurses6-8.4.3/lib/ghc-8.4.3/html/Classic.theme/"
@(src/Stack/Setup.hs:1097:54)
2018-10-11 15:26:55.213496: [debug] /usr/bin/install -c -m 644 utils/haddock/haddock-api/resources/html/Classic.theme/plus.gif "/home/leon/.stack/programs/x86_64-linux/ghc-ncurses6-8.4.3/lib/ghc-8.4.3/html/Classic.theme/"
@(src/Stack/Setup.hs:1097:54)
2018-10-11 15:26:55.216182: [debug] /usr/bin/install -c -m 644 utils/haddock/haddock-api/resources/html/Classic.theme/xhaddock.css "/home/leon/.stack/programs/x86_64-linux/ghc-ncurses6-8.4.3/lib/ghc-8.4.3/html/Classic.theme/"
@(src/Stack/Setup.hs:1097:54)
2018-10-11 15:26:55.218600: [debug] /usr/bin/install -c -m 644 utils/haddock/haddock-api/resources/html/Ocean.std-theme/hslogo-16.png "/home/leon/.stack/programs/x86_64-linux/ghc-ncurses6-8.4.3/lib/ghc-8.4.3/html/Ocean.std-theme/"
@(src/Stack/Setup.hs:1097:54)
2018-10-11 15:26:55.221101: [debug] /usr/bin/install -c -m 644 utils/haddock/haddock-api/resources/html/Ocean.std-theme/minus.gif "/home/leon/.stack/programs/x86_64-linux/ghc-ncurses6-8.4.3/lib/ghc-8.4.3/html/Ocean.std-theme/"
@(src/Stack/Setup.hs:1097:54)
2018-10-11 15:26:55.223658: [debug] /usr/bin/install -c -m 644 utils/haddock/haddock-api/resources/html/Ocean.std-theme/ocean.css "/home/leon/.stack/programs/x86_64-linux/ghc-ncurses6-8.4.3/lib/ghc-8.4.3/html/Ocean.std-theme/"
@(src/Stack/Setup.hs:1097:54)
2018-10-11 15:26:55.225741: [debug] /usr/bin/install -c -m 644 utils/haddock/haddock-api/resources/html/Ocean.std-theme/plus.gif "/home/leon/.stack/programs/x86_64-linux/ghc-ncurses6-8.4.3/lib/ghc-8.4.3/html/Ocean.std-theme/"
@(src/Stack/Setup.hs:1097:54)
2018-10-11 15:26:55.228091: [debug] /usr/bin/install -c -m 644 utils/haddock/haddock-api/resources/html/Ocean.std-theme/synopsis.png "/home/leon/.stack/programs/x86_64-linux/ghc-ncurses6-8.4.3/lib/ghc-8.4.3/html/Ocean.std-theme/"
@(src/Stack/Setup.hs:1097:54)
2018-10-11 15:26:55.230247: [debug] /usr/bin/install -c -m 644 utils/haddock/haddock-api/resources/html/solarized.css "/home/leon/.stack/programs/x86_64-linux/ghc-ncurses6-8.4.3/lib/ghc-8.4.3/html/"
@(src/Stack/Setup.hs:1097:54)
2018-10-11 15:26:55.233250: [debug] /usr/bin/install -c -m 644 utils/haddock/haddock-api/resources/html/highlight.js "/home/leon/.stack/programs/x86_64-linux/ghc-ncurses6-8.4.3/lib/ghc-8.4.3/html/"
@(src/Stack/Setup.hs:1097:54)
2018-10-11 15:26:55.236677: [debug] /usr/bin/install -c -m 644 utils/haddock/haddock-api/resources/latex/haddock.sty "/home/leon/.stack/programs/x86_64-linux/ghc-ncurses6-8.4.3/lib/ghc-8.4.3/latex/"
@(src/Stack/Setup.hs:1097:54)
2018-10-11 15:26:55.239095: [debug] "rm" -f "/home/leon/.stack/programs/x86_64-linux/ghc-ncurses6-8.4.3/bin/haddock"
@(src/Stack/Setup.hs:1097:54)
2018-10-11 15:26:55.241601: [debug] ln -s haddock-ghc-8.4.3 "/home/leon/.stack/programs/x86_64-linux/ghc-ncurses6-8.4.3/bin/haddock"
@(src/Stack/Setup.hs:1097:54)
2018-10-11 15:26:55.243911: [debug] /usr/bin/install -c -m 755 -d "/home/leon/.stack/programs/x86_64-linux/ghc-ncurses6-8.4.3/bin"
@(src/Stack/Setup.hs:1097:54)
2018-10-11 15:26:55.246659: [debug] "rm" -f "/home/leon/.stack/programs/x86_64-linux/ghc-ncurses6-8.4.3/bin/hsc2hs"
@(src/Stack/Setup.hs:1097:54)
2018-10-11 15:26:55.248843: [debug] create () { touch "$1" && chmod 755 "$1" ; } && create "/home/leon/.stack/programs/x86_64-linux/ghc-ncurses6-8.4.3/bin/hsc2hs"
@(src/Stack/Setup.hs:1097:54)
2018-10-11 15:26:55.252843: [debug] echo '#!/bin/sh' >> "/home/leon/.stack/programs/x86_64-linux/ghc-ncurses6-8.4.3/bin/hsc2hs"
@(src/Stack/Setup.hs:1097:54)
2018-10-11 15:26:55.253941: [debug] echo 'exedir="/home/leon/.stack/programs/x86_64-linux/ghc-ncurses6-8.4.3/lib/ghc-8.4.3/bin"' >> "/home/leon/.stack/programs/x86_64-linux/ghc-ncurses6-8.4.3/bin/hsc2hs"
@(src/Stack/Setup.hs:1097:54)
2018-10-11 15:26:55.254880: [debug] echo 'exeprog="hsc2hs"' >> "/home/leon/.stack/programs/x86_64-linux/ghc-ncurses6-8.4.3/bin/hsc2hs"
@(src/Stack/Setup.hs:1097:54)
2018-10-11 15:26:55.255727: [debug] echo 'executablename="$exedir/$exeprog"' >> "/home/leon/.stack/programs/x86_64-linux/ghc-ncurses6-8.4.3/bin/hsc2hs"
@(src/Stack/Setup.hs:1097:54)
2018-10-11 15:26:55.256472: [debug] echo 'datadir="/home/leon/.stack/programs/x86_64-linux/ghc-ncurses6-8.4.3/share"' >> "/home/leon/.stack/programs/x86_64-linux/ghc-ncurses6-8.4.3/bin/hsc2hs"
@(src/Stack/Setup.hs:1097:54)
2018-10-11 15:26:55.257414: [debug] echo 'bindir="/home/leon/.stack/programs/x86_64-linux/ghc-ncurses6-8.4.3/bin"' >> "/home/leon/.stack/programs/x86_64-linux/ghc-ncurses6-8.4.3/bin/hsc2hs"
@(src/Stack/Setup.hs:1097:54)
2018-10-11 15:26:55.258269: [debug] echo 'topdir="/home/leon/.stack/programs/x86_64-linux/ghc-ncurses6-8.4.3/lib/ghc-8.4.3"' >> "/home/leon/.stack/programs/x86_64-linux/ghc-ncurses6-8.4.3/bin/hsc2hs"
@(src/Stack/Setup.hs:1097:54)
2018-10-11 15:26:55.259029: [debug] echo 'HSC2HS_EXTRA="--cflag=-fno-stack-protector --lflag=-fuse-ld=gold"' >> "/home/leon/.stack/programs/x86_64-linux/ghc-ncurses6-8.4.3/bin/hsc2hs"
@(src/Stack/Setup.hs:1097:54)
2018-10-11 15:26:55.259853: [debug] cat utils/hsc2hs/hsc2hs.wrapper >> "/home/leon/.stack/programs/x86_64-linux/ghc-ncurses6-8.4.3/bin/hsc2hs"
@(src/Stack/Setup.hs:1097:54)
2018-10-11 15:26:55.261738: [debug] chmod +x "/home/leon/.stack/programs/x86_64-linux/ghc-ncurses6-8.4.3/bin/hsc2hs"
@(src/Stack/Setup.hs:1097:54)
2018-10-11 15:26:55.263836: [debug] /usr/bin/install -c -m 644 utils/hsc2hs/template-hsc.h "/home/leon/.stack/programs/x86_64-linux/ghc-ncurses6-8.4.3/lib/ghc-8.4.3"
@(src/Stack/Setup.hs:1097:54)
2018-10-11 15:26:55.267182: [debug] /usr/bin/install -c -m 755 -d "/home/leon/.stack/programs/x86_64-linux/ghc-ncurses6-8.4.3/bin"
@(src/Stack/Setup.hs:1097:54)
2018-10-11 15:26:55.269752: [debug] "rm" -f "/home/leon/.stack/programs/x86_64-linux/ghc-ncurses6-8.4.3/bin/ghc-pkg-8.4.3"
@(src/Stack/Setup.hs:1097:54)
2018-10-11 15:26:55.271833: [debug] create () { touch "$1" && chmod 755 "$1" ; } && create "/home/leon/.stack/programs/x86_64-linux/ghc-ncurses6-8.4.3/bin/ghc-pkg-8.4.3"
@(src/Stack/Setup.hs:1097:54)
2018-10-11 15:26:55.274171: [debug] echo '#!/bin/sh' >> "/home/leon/.stack/programs/x86_64-linux/ghc-ncurses6-8.4.3/bin/ghc-pkg-8.4.3"
@(src/Stack/Setup.hs:1097:54)
2018-10-11 15:26:55.274802: [debug] echo 'exedir="/home/leon/.stack/programs/x86_64-linux/ghc-ncurses6-8.4.3/lib/ghc-8.4.3/bin"' >> "/home/leon/.stack/programs/x86_64-linux/ghc-ncurses6-8.4.3/bin/ghc-pkg-8.4.3"
@(src/Stack/Setup.hs:1097:54)
2018-10-11 15:26:55.275768: [debug] echo 'exeprog="ghc-pkg"' >> "/home/leon/.stack/programs/x86_64-linux/ghc-ncurses6-8.4.3/bin/ghc-pkg-8.4.3"
@(src/Stack/Setup.hs:1097:54)
2018-10-11 15:26:55.276493: [debug] echo 'executablename="$exedir/$exeprog"' >> "/home/leon/.stack/programs/x86_64-linux/ghc-ncurses6-8.4.3/bin/ghc-pkg-8.4.3"
@(src/Stack/Setup.hs:1097:54)
2018-10-11 15:26:55.277476: [debug] echo 'datadir="/home/leon/.stack/programs/x86_64-linux/ghc-ncurses6-8.4.3/share"' >> "/home/leon/.stack/programs/x86_64-linux/ghc-ncurses6-8.4.3/bin/ghc-pkg-8.4.3"
@(src/Stack/Setup.hs:1097:54)
2018-10-11 15:26:55.277989: [debug] echo 'bindir="/home/leon/.stack/programs/x86_64-linux/ghc-ncurses6-8.4.3/bin"' >> "/home/leon/.stack/programs/x86_64-linux/ghc-ncurses6-8.4.3/bin/ghc-pkg-8.4.3"
@(src/Stack/Setup.hs:1097:54)
2018-10-11 15:26:55.278708: [debug] echo 'topdir="/home/leon/.stack/programs/x86_64-linux/ghc-ncurses6-8.4.3/lib/ghc-8.4.3"' >> "/home/leon/.stack/programs/x86_64-linux/ghc-ncurses6-8.4.3/bin/ghc-pkg-8.4.3"
@(src/Stack/Setup.hs:1097:54)
2018-10-11 15:26:55.279582: [debug] cat utils/ghc-pkg/ghc-pkg.wrapper >> "/home/leon/.stack/programs/x86_64-linux/ghc-ncurses6-8.4.3/bin/ghc-pkg-8.4.3"
@(src/Stack/Setup.hs:1097:54)
2018-10-11 15:26:55.281042: [debug] chmod +x "/home/leon/.stack/programs/x86_64-linux/ghc-ncurses6-8.4.3/bin/ghc-pkg-8.4.3"
@(src/Stack/Setup.hs:1097:54)
2018-10-11 15:26:55.283137: [debug] /usr/bin/install -c -m 755 -d "/home/leon/.stack/programs/x86_64-linux/ghc-ncurses6-8.4.3/bin"
@(src/Stack/Setup.hs:1097:54)
2018-10-11 15:26:55.286183: [debug] "rm" -f "/home/leon/.stack/programs/x86_64-linux/ghc-ncurses6-8.4.3/bin/ghc-pkg"
@(src/Stack/Setup.hs:1097:54)
2018-10-11 15:26:55.288370: [debug] ln -s ghc-pkg-8.4.3 "/home/leon/.stack/programs/x86_64-linux/ghc-ncurses6-8.4.3/bin/ghc-pkg"
@(src/Stack/Setup.hs:1097:54)
2018-10-11 15:26:55.290605: [debug] /usr/bin/install -c -m 755 -d "/home/leon/.stack/programs/x86_64-linux/ghc-ncurses6-8.4.3/bin"
@(src/Stack/Setup.hs:1097:54)
2018-10-11 15:26:55.293243: [debug] "rm" -f "/home/leon/.stack/programs/x86_64-linux/ghc-ncurses6-8.4.3/bin/hpc"
@(src/Stack/Setup.hs:1097:54)
2018-10-11 15:26:55.295390: [debug] create () { touch "$1" && chmod 755 "$1" ; } && create "/home/leon/.stack/programs/x86_64-linux/ghc-ncurses6-8.4.3/bin/hpc"
@(src/Stack/Setup.hs:1097:54)
2018-10-11 15:26:55.298533: [debug] echo '#!/bin/sh' >> "/home/leon/.stack/programs/x86_64-linux/ghc-ncurses6-8.4.3/bin/hpc"
@(src/Stack/Setup.hs:1097:54)
2018-10-11 15:26:55.299927: [debug] echo 'exedir="/home/leon/.stack/programs/x86_64-linux/ghc-ncurses6-8.4.3/lib/ghc-8.4.3/bin"' >> "/home/leon/.stack/programs/x86_64-linux/ghc-ncurses6-8.4.3/bin/hpc"
@(src/Stack/Setup.hs:1097:54)
2018-10-11 15:26:55.300961: [debug] echo 'exeprog="hpc"' >> "/home/leon/.stack/programs/x86_64-linux/ghc-ncurses6-8.4.3/bin/hpc"
@(src/Stack/Setup.hs:1097:54)
2018-10-11 15:26:55.302144: [debug] echo 'executablename="$exedir/$exeprog"' >> "/home/leon/.stack/programs/x86_64-linux/ghc-ncurses6-8.4.3/bin/hpc"
@(src/Stack/Setup.hs:1097:54)
2018-10-11 15:26:55.303374: [debug] echo 'datadir="/home/leon/.stack/programs/x86_64-linux/ghc-ncurses6-8.4.3/share"' >> "/home/leon/.stack/programs/x86_64-linux/ghc-ncurses6-8.4.3/bin/hpc"
@(src/Stack/Setup.hs:1097:54)
2018-10-11 15:26:55.304521: [debug] echo 'bindir="/home/leon/.stack/programs/x86_64-linux/ghc-ncurses6-8.4.3/bin"' >> "/home/leon/.stack/programs/x86_64-linux/ghc-ncurses6-8.4.3/bin/hpc"
@(src/Stack/Setup.hs:1097:54)
2018-10-11 15:26:55.305617: [debug] echo 'topdir="/home/leon/.stack/programs/x86_64-linux/ghc-ncurses6-8.4.3/lib/ghc-8.4.3"' >> "/home/leon/.stack/programs/x86_64-linux/ghc-ncurses6-8.4.3/bin/hpc"
@(src/Stack/Setup.hs:1097:54)
2018-10-11 15:26:55.306671: [debug] cat utils/hpc/hpc.wrapper >> "/home/leon/.stack/programs/x86_64-linux/ghc-ncurses6-8.4.3/bin/hpc"
@(src/Stack/Setup.hs:1097:54)
2018-10-11 15:26:55.308693: [debug] chmod +x "/home/leon/.stack/programs/x86_64-linux/ghc-ncurses6-8.4.3/bin/hpc"
@(src/Stack/Setup.hs:1097:54)
2018-10-11 15:26:55.310906: [debug] /usr/bin/install -c -m 755 -d "/home/leon/.stack/programs/x86_64-linux/ghc-ncurses6-8.4.3/bin"
@(src/Stack/Setup.hs:1097:54)
2018-10-11 15:26:55.313517: [debug] "rm" -f "/home/leon/.stack/programs/x86_64-linux/ghc-ncurses6-8.4.3/bin/runghc-8.4.3"
@(src/Stack/Setup.hs:1097:54)
2018-10-11 15:26:55.316637: [debug] create () { touch "$1" && chmod 755 "$1" ; } && create "/home/leon/.stack/programs/x86_64-linux/ghc-ncurses6-8.4.3/bin/runghc-8.4.3"
@(src/Stack/Setup.hs:1097:54)
2018-10-11 15:26:55.320523: [debug] echo '#!/bin/sh' >> "/home/leon/.stack/programs/x86_64-linux/ghc-ncurses6-8.4.3/bin/runghc-8.4.3"
@(src/Stack/Setup.hs:1097:54)
2018-10-11 15:26:55.321467: [debug] echo 'exedir="/home/leon/.stack/programs/x86_64-linux/ghc-ncurses6-8.4.3/lib/ghc-8.4.3/bin"' >> "/home/leon/.stack/programs/x86_64-linux/ghc-ncurses6-8.4.3/bin/runghc-8.4.3"
@(src/Stack/Setup.hs:1097:54)
2018-10-11 15:26:55.322166: [debug] echo 'exeprog="runghc"' >> "/home/leon/.stack/programs/x86_64-linux/ghc-ncurses6-8.4.3/bin/runghc-8.4.3"
@(src/Stack/Setup.hs:1097:54)
2018-10-11 15:26:55.323294: [debug] echo 'executablename="$exedir/$exeprog"' >> "/home/leon/.stack/programs/x86_64-linux/ghc-ncurses6-8.4.3/bin/runghc-8.4.3"
@(src/Stack/Setup.hs:1097:54)
2018-10-11 15:26:55.324270: [debug] echo 'datadir="/home/leon/.stack/programs/x86_64-linux/ghc-ncurses6-8.4.3/share"' >> "/home/leon/.stack/programs/x86_64-linux/ghc-ncurses6-8.4.3/bin/runghc-8.4.3"
@(src/Stack/Setup.hs:1097:54)
2018-10-11 15:26:55.325314: [debug] echo 'bindir="/home/leon/.stack/programs/x86_64-linux/ghc-ncurses6-8.4.3/bin"' >> "/home/leon/.stack/programs/x86_64-linux/ghc-ncurses6-8.4.3/bin/runghc-8.4.3"
@(src/Stack/Setup.hs:1097:54)
2018-10-11 15:26:55.326354: [debug] echo 'topdir="/home/leon/.stack/programs/x86_64-linux/ghc-ncurses6-8.4.3/lib/ghc-8.4.3"' >> "/home/leon/.stack/programs/x86_64-linux/ghc-ncurses6-8.4.3/bin/runghc-8.4.3"
@(src/Stack/Setup.hs:1097:54)
2018-10-11 15:26:55.327238: [debug] echo 'ghcprog="ghc-8.4.3"' >> "/home/leon/.stack/programs/x86_64-linux/ghc-ncurses6-8.4.3/bin/runghc-8.4.3"
@(src/Stack/Setup.hs:1097:54)
2018-10-11 15:26:55.328085: [debug] cat utils/runghc/runghc.wrapper >> "/home/leon/.stack/programs/x86_64-linux/ghc-ncurses6-8.4.3/bin/runghc-8.4.3"
@(src/Stack/Setup.hs:1097:54)
2018-10-11 15:26:55.329988: [debug] chmod +x "/home/leon/.stack/programs/x86_64-linux/ghc-ncurses6-8.4.3/bin/runghc-8.4.3"
@(src/Stack/Setup.hs:1097:54)
2018-10-11 15:26:55.332467: [debug] "rm" -f "/home/leon/.stack/programs/x86_64-linux/ghc-ncurses6-8.4.3/bin/runhaskell"
@(src/Stack/Setup.hs:1097:54)
2018-10-11 15:26:55.336506: [debug] ln -s runghc "/home/leon/.stack/programs/x86_64-linux/ghc-ncurses6-8.4.3/bin/runhaskell"
@(src/Stack/Setup.hs:1097:54)
2018-10-11 15:26:55.338527: [debug] "rm" -f "/home/leon/.stack/programs/x86_64-linux/ghc-ncurses6-8.4.3/bin/runghc"
@(src/Stack/Setup.hs:1097:54)
2018-10-11 15:26:55.340796: [debug] ln -s runghc-8.4.3 "/home/leon/.stack/programs/x86_64-linux/ghc-ncurses6-8.4.3/bin/runghc"
@(src/Stack/Setup.hs:1097:54)
2018-10-11 15:26:55.343290: [debug] /usr/bin/install -c -m 755 -d "/home/leon/.stack/programs/x86_64-linux/ghc-ncurses6-8.4.3/bin"
@(src/Stack/Setup.hs:1097:54)
2018-10-11 15:26:55.346324: [debug] "rm" -f "/home/leon/.stack/programs/x86_64-linux/ghc-ncurses6-8.4.3/bin/ghc-8.4.3"
@(src/Stack/Setup.hs:1097:54)
2018-10-11 15:26:55.352928: [debug] create () { touch "$1" && chmod 755 "$1" ; } && create "/home/leon/.stack/programs/x86_64-linux/ghc-ncurses6-8.4.3/bin/ghc-8.4.3"
@(src/Stack/Setup.hs:1097:54)
2018-10-11 15:26:55.356741: [debug] echo '#!/bin/sh' >> "/home/leon/.stack/programs/x86_64-linux/ghc-ncurses6-8.4.3/bin/ghc-8.4.3"
@(src/Stack/Setup.hs:1097:54)
2018-10-11 15:26:55.357878: [debug] echo 'exedir="/home/leon/.stack/programs/x86_64-linux/ghc-ncurses6-8.4.3/lib/ghc-8.4.3/bin"' >> "/home/leon/.stack/programs/x86_64-linux/ghc-ncurses6-8.4.3/bin/ghc-8.4.3"
@(src/Stack/Setup.hs:1097:54)
2018-10-11 15:26:55.358787: [debug] echo 'exeprog="ghc-stage2"' >> "/home/leon/.stack/programs/x86_64-linux/ghc-ncurses6-8.4.3/bin/ghc-8.4.3"
@(src/Stack/Setup.hs:1097:54)
2018-10-11 15:26:55.359574: [debug] echo 'executablename="$exedir/$exeprog"' >> "/home/leon/.stack/programs/x86_64-linux/ghc-ncurses6-8.4.3/bin/ghc-8.4.3"
@(src/Stack/Setup.hs:1097:54)
2018-10-11 15:26:55.360709: [debug] echo 'datadir="/home/leon/.stack/programs/x86_64-linux/ghc-ncurses6-8.4.3/share"' >> "/home/leon/.stack/programs/x86_64-linux/ghc-ncurses6-8.4.3/bin/ghc-8.4.3"
@(src/Stack/Setup.hs:1097:54)
2018-10-11 15:26:55.361655: [debug] echo 'bindir="/home/leon/.stack/programs/x86_64-linux/ghc-ncurses6-8.4.3/bin"' >> "/home/leon/.stack/programs/x86_64-linux/ghc-ncurses6-8.4.3/bin/ghc-8.4.3"
@(src/Stack/Setup.hs:1097:54)
2018-10-11 15:26:55.362650: [debug] echo 'topdir="/home/leon/.stack/programs/x86_64-linux/ghc-ncurses6-8.4.3/lib/ghc-8.4.3"' >> "/home/leon/.stack/programs/x86_64-linux/ghc-ncurses6-8.4.3/bin/ghc-8.4.3"
@(src/Stack/Setup.hs:1097:54)
2018-10-11 15:26:55.363501: [debug] echo 'executablename="$exedir/ghc"' >> "/home/leon/.stack/programs/x86_64-linux/ghc-ncurses6-8.4.3/bin/ghc-8.4.3"
@(src/Stack/Setup.hs:1097:54)
2018-10-11 15:26:55.364399: [debug] cat ghc/ghc.wrapper >> "/home/leon/.stack/programs/x86_64-linux/ghc-ncurses6-8.4.3/bin/ghc-8.4.3"
@(src/Stack/Setup.hs:1097:54)
2018-10-11 15:26:55.369206: [debug] chmod +x "/home/leon/.stack/programs/x86_64-linux/ghc-ncurses6-8.4.3/bin/ghc-8.4.3"
@(src/Stack/Setup.hs:1097:54)
2018-10-11 15:26:55.371279: [debug] "rm" -f "/home/leon/.stack/programs/x86_64-linux/ghc-ncurses6-8.4.3/bin/ghc"
@(src/Stack/Setup.hs:1097:54)
2018-10-11 15:26:55.373716: [debug] ln -s ghc-8.4.3 "/home/leon/.stack/programs/x86_64-linux/ghc-ncurses6-8.4.3/bin/ghc"
@(src/Stack/Setup.hs:1097:54)
2018-10-11 15:26:55.375849: [debug] /usr/bin/install -c -m 755 -d "/home/leon/.stack/programs/x86_64-linux/ghc-ncurses6-8.4.3/share/man"
@(src/Stack/Setup.hs:1097:54)
2018-10-11 15:26:55.378165: [debug] /usr/bin/install -c -m 755 -d "/home/leon/.stack/programs/x86_64-linux/ghc-ncurses6-8.4.3/share/man/man1"
@(src/Stack/Setup.hs:1097:54)
2018-10-11 15:26:55.380205: [debug] /usr/bin/install -c -m 644 docs/users_guide/build-man/ghc.1 "/home/leon/.stack/programs/x86_64-linux/ghc-ncurses6-8.4.3/share/man/man1"
@(src/Stack/Setup.hs:1097:54)
2018-10-11 15:26:55.383948: [debug] # driver/ghc-usage.txt driver/ghci-usage.txt includes/dist-derivedconstants/header/platformConstants settings llvm-targets = libraries to install
@(src/Stack/Setup.hs:1097:54)
2018-10-11 15:26:55.385689: [debug] # "/home/leon/.stack/programs/x86_64-linux/ghc-ncurses6-8.4.3/lib/ghc-8.4.3" = directory to install to
@(src/Stack/Setup.hs:1097:54)
2018-10-11 15:26:55.386722: [debug] #
@(src/Stack/Setup.hs:1097:54)
2018-10-11 15:26:55.387614: [debug] # The .dll case calls STRIP_CMD explicitly, instead of `install -s`, because
@(src/Stack/Setup.hs:1097:54)
2018-10-11 15:26:55.388617: [debug] # on Win64, "install -s" calls a strip that doesn't understand 64bit binaries.
@(src/Stack/Setup.hs:1097:54)
2018-10-11 15:26:55.389312: [debug] # For some reason, this means the DLLs end up non-executable, which means
@(src/Stack/Setup.hs:1097:54)
2018-10-11 15:26:55.389929: [debug] # executables that use them just segfault.
@(src/Stack/Setup.hs:1097:54)
2018-10-11 15:26:55.390667: [debug] /usr/bin/install -c -m 755 -d "/home/leon/.stack/programs/x86_64-linux/ghc-ncurses6-8.4.3/lib/ghc-8.4.3"
@(src/Stack/Setup.hs:1097:54)
2018-10-11 15:26:55.392843: [debug] for i in driver/ghc-usage.txt driver/ghci-usage.txt includes/dist-derivedconstants/header/platformConstants settings llvm-targets; do case $i in *.a) /usr/bin/install -c -m 644 $i "/home/leon/.stack/programs/x86_64-linux/ghc-ncurses6-8.4.3/lib/ghc-8.4.3"; true "/home/leon/.stack/programs/x86_64-linux/ghc-ncurses6-8.4.3/lib/ghc-8.4.3"/`basename $i` ;; *.dll) /usr/bin/install -c -m 755 $i "/home/leon/.stack/programs/x86_64-linux/ghc-ncurses6-8.4.3/lib/ghc-8.4.3" ; strip "/home/leon/.stack/programs/x86_64-linux/ghc-ncurses6-8.4.3/lib/ghc-8.4.3"/`basename $i` ;; *.so) /usr/bin/install -c -m 755 $i "/home/leon/.stack/programs/x86_64-linux/ghc-ncurses6-8.4.3/lib/ghc-8.4.3" ;; *.dylib) /usr/bin/install -c -m 755 $i "/home/leon/.stack/programs/x86_64-linux/ghc-ncurses6-8.4.3/lib/ghc-8.4.3";; *) /usr/bin/install -c -m 644 $i "/home/leon/.stack/programs/x86_64-linux/ghc-ncurses6-8.4.3/lib/ghc-8.4.3"; esac; done
@(src/Stack/Setup.hs:1097:54)
2018-10-11 15:26:55.402735: [debug] gcc -E -undef -traditional -P -DINSTALLING -DLIB_DIR='"/home/leon/.stack/programs/x86_64-linux/ghc-ncurses6-8.4.3/lib/ghc-8.4.3"' -DINCLUDE_DIR='"/home/leon/.stack/programs/x86_64-linux/ghc-ncurses6-8.4.3/lib/ghc-8.4.3/include"' -DFFI_INCLUDE_DIR= -DFFI_LIB_DIR= '-DFFI_LIB="Cffi"' -x c -Iincludes -Iincludes/dist -Iincludes/dist-derivedconstants/header -Iincludes/dist-ghcconstants/header rts/package.conf.in -o rts/dist/package.conf.install.raw
@(src/Stack/Setup.hs:1097:54)
2018-10-11 15:26:55.410318: [debug] grep -v '^#pragma GCC' rts/dist/package.conf.install.raw | sed -e 's/""//g' -e 's/:[ ]*,/: /g' >rts/dist/package.conf.install
@(src/Stack/Setup.hs:1097:54)
2018-10-11 15:26:55.415466: [debug] /usr/bin/install -c -m 755 -d "/home/leon/.stack/programs/x86_64-linux/ghc-ncurses6-8.4.3/lib/ghc-8.4.3/bin"
@(src/Stack/Setup.hs:1097:54)
2018-10-11 15:26:55.418615: [debug] for i in utils/unlit/dist-install/build/tmp/unlit utils/hp2ps/dist-install/build/tmp/hp2ps utils/hp2ps/dist-install/build/tmp/hp2ps utils/haddock/dist/build/tmp/haddock utils/haddock/dist/build/tmp/haddock utils/hsc2hs/dist-install/build/tmp/hsc2hs utils/hsc2hs/dist-install/build/tmp/hsc2hs utils/ghc-pkg/dist-install/build/tmp/ghc-pkg utils/ghc-pkg/dist-install/build/tmp/ghc-pkg utils/hpc/dist-install/build/tmp/hpc utils/hpc/dist-install/build/tmp/hpc utils/runghc/dist-install/build/tmp/runghc utils/runghc/dist-install/build/tmp/runghc ghc/stage2/build/tmp/ghc-stage2 ghc/stage2/build/tmp/ghc-stage2 iserv/stage2/build/tmp/ghc-iserv iserv/stage2_p/build/tmp/ghc-iserv-prof iserv/stage2_dyn/build/tmp/ghc-iserv-dyn; do
@(src/Stack/Setup.hs:1097:54)
2018-10-11 15:26:55.419042: [debug] /usr/bin/install -c -m 755 $i "/home/leon/.stack/programs/x86_64-linux/ghc-ncurses6-8.4.3/lib/ghc-8.4.3/bin";
@(src/Stack/Setup.hs:1097:54)
2018-10-11 15:26:55.419245: [debug] done
@(src/Stack/Setup.hs:1097:54)
2018-10-11 15:26:55.991331: [debug] "mv" "/home/leon/.stack/programs/x86_64-linux/ghc-ncurses6-8.4.3/lib/ghc-8.4.3/bin/ghc-stage2" "/home/leon/.stack/programs/x86_64-linux/ghc-ncurses6-8.4.3/lib/ghc-8.4.3/bin/ghc"
@(src/Stack/Setup.hs:1097:54)
2018-10-11 15:26:55.997589: [debug] /usr/bin/install -c -m 755 -d "/home/leon/.stack/programs/x86_64-linux/ghc-ncurses6-8.4.3/lib/ghc-8.4.3"
@(src/Stack/Setup.hs:1097:54)
2018-10-11 15:26:56.001143: [debug] "rm" -rf "/home/leon/.stack/programs/x86_64-linux/ghc-ncurses6-8.4.3/lib/ghc-8.4.3/package.conf.d"
@(src/Stack/Setup.hs:1097:54)
2018-10-11 15:26:56.003013: [debug] /usr/bin/install -c -m 755 -d "/home/leon/.stack/programs/x86_64-linux/ghc-ncurses6-8.4.3/lib/ghc-8.4.3/package.conf.d"
@(src/Stack/Setup.hs:1097:54)
2018-10-11 15:26:56.004453: [debug] /usr/bin/install -c -m 755 -d "/home/leon/.stack/programs/x86_64-linux/ghc-ncurses6-8.4.3/lib/ghc-8.4.3/rts"
@(src/Stack/Setup.hs:1097:54)
2018-10-11 15:26:56.008470: [debug] # rts/dist/build/libHSrts.a rts/dist/build/libHSrts_p.a rts/dist/build/libHSrts-ghc8.4.3.so rts/dist/build/libHSrts_l.a rts/dist/build/libHSrts_debug.a rts/dist/build/libHSrts_thr.a rts/dist/build/libHSrts_thr_debug.a rts/dist/build/libHSrts_thr_l.a rts/dist/build/libHSrts_thr_p.a rts/dist/build/libHSrts_debug-ghc8.4.3.so rts/dist/build/libHSrts_thr-ghc8.4.3.so rts/dist/build/libHSrts_thr_debug-ghc8.4.3.so rts/dist/build/libHSrts_l-ghc8.4.3.so rts/dist/build/libHSrts_thr_l-ghc8.4.3.so rts/dist/build/libffi.so.7.1.0 rts/dist/build/libffi.so.7 rts/dist/build/libffi.so rts/dist/build/libCffi.a rts/dist/build/libCffi_p.a rts/dist/build/libCffi_l.a rts/dist/build/libCffi_debug.a rts/dist/build/libCffi_thr.a rts/dist/build/libCffi_thr_debug.a rts/dist/build/libCffi_thr_l.a rts/dist/build/libCffi_thr_p.a = libraries to install
@(src/Stack/Setup.hs:1097:54)
2018-10-11 15:26:56.009163: [debug] # "/home/leon/.stack/programs/x86_64-linux/ghc-ncurses6-8.4.3/lib/ghc-8.4.3/rts" = directory to install to
@(src/Stack/Setup.hs:1097:54)
2018-10-11 15:26:56.010269: [debug] #
@(src/Stack/Setup.hs:1097:54)
2018-10-11 15:26:56.011506: [debug] # The .dll case calls STRIP_CMD explicitly, instead of `install -s`, because
@(src/Stack/Setup.hs:1097:54)
2018-10-11 15:26:56.012042: [debug] # on Win64, "install -s" calls a strip that doesn't understand 64bit binaries.
@(src/Stack/Setup.hs:1097:54)
2018-10-11 15:26:56.012664: [debug] # For some reason, this means the DLLs end up non-executable, which means
@(src/Stack/Setup.hs:1097:54)
2018-10-11 15:26:56.013147: [debug] # executables that use them just segfault.
@(src/Stack/Setup.hs:1097:54)
2018-10-11 15:26:56.013693: [debug] /usr/bin/install -c -m 755 -d "/home/leon/.stack/programs/x86_64-linux/ghc-ncurses6-8.4.3/lib/ghc-8.4.3/rts"
@(src/Stack/Setup.hs:1097:54)
2018-10-11 15:26:56.015673: [debug] for i in rts/dist/build/libHSrts.a rts/dist/build/libHSrts_p.a rts/dist/build/libHSrts-ghc8.4.3.so rts/dist/build/libHSrts_l.a rts/dist/build/libHSrts_debug.a rts/dist/build/libHSrts_thr.a rts/dist/build/libHSrts_thr_debug.a rts/dist/build/libHSrts_thr_l.a rts/dist/build/libHSrts_thr_p.a rts/dist/build/libHSrts_debug-ghc8.4.3.so rts/dist/build/libHSrts_thr-ghc8.4.3.so rts/dist/build/libHSrts_thr_debug-ghc8.4.3.so rts/dist/build/libHSrts_l-ghc8.4.3.so rts/dist/build/libHSrts_thr_l-ghc8.4.3.so rts/dist/build/libffi.so.7.1.0 rts/dist/build/libffi.so.7 rts/dist/build/libffi.so rts/dist/build/libCffi.a rts/dist/build/libCffi_p.a rts/dist/build/libCffi_l.a rts/dist/build/libCffi_debug.a rts/dist/build/libCffi_thr.a rts/dist/build/libCffi_thr_debug.a rts/dist/build/libCffi_thr_l.a rts/dist/build/libCffi_thr_p.a; do case $i in *.a) /usr/bin/install -c -m 644 $i "/home/leon/.stack/programs/x86_64-linux/ghc-ncurses6-8.4.3/lib/ghc-8.4.3/rts"; true "/home/leon/.stack/programs/x86_64-linux/ghc-ncurses6-8.4.3/lib/ghc-8.4.3/rts"/`basename $i` ;; *.dll) /usr/bin/install -c -m 755 $i "/home/leon/.stack/programs/x86_64-linux/ghc-ncurses6-8.4.3/lib/ghc-8.4.3/rts" ; strip "/home/leon/.stack/programs/x86_64-linux/ghc-ncurses6-8.4.3/lib/ghc-8.4.3/rts"/`basename $i` ;; *.so) /usr/bin/install -c -m 755 $i "/home/leon/.stack/programs/x86_64-linux/ghc-ncurses6-8.4.3/lib/ghc-8.4.3/rts" ;; *.dylib) /usr/bin/install -c -m 755 $i "/home/leon/.stack/programs/x86_64-linux/ghc-ncurses6-8.4.3/lib/ghc-8.4.3/rts";; *) /usr/bin/install -c -m 644 $i "/home/leon/.stack/programs/x86_64-linux/ghc-ncurses6-8.4.3/lib/ghc-8.4.3/rts"; esac; done
@(src/Stack/Setup.hs:1097:54)
2018-10-11 15:26:56.143205: [debug] "utils/ghc-cabal/dist-install/build/tmp/ghc-cabal-bindist" copy libraries/ghc-prim dist-install "strip" '' '/home/leon/.stack/programs/x86_64-linux/ghc-ncurses6-8.4.3' '/home/leon/.stack/programs/x86_64-linux/ghc-ncurses6-8.4.3/lib/ghc-8.4.3' '/home/leon/.stack/programs/x86_64-linux/ghc-ncurses6-8.4.3/share/doc/ghc-8.4.3/html/libraries' 'v p dyn'
@(src/Stack/Setup.hs:1097:54)
2018-10-11 15:26:56.472631: [debug] Installing library in /home/leon/.stack/programs/x86_64-linux/ghc-ncurses6-8.4.3/lib/ghc-8.4.3/ghc-prim-0.5.2.0
@(src/Stack/Setup.hs:1097:54)
2018-10-11 15:26:57.278123: [debug] "utils/ghc-cabal/dist-install/build/tmp/ghc-cabal-bindist" copy libraries/integer-gmp dist-install "strip" '' '/home/leon/.stack/programs/x86_64-linux/ghc-ncurses6-8.4.3' '/home/leon/.stack/programs/x86_64-linux/ghc-ncurses6-8.4.3/lib/ghc-8.4.3' '/home/leon/.stack/programs/x86_64-linux/ghc-ncurses6-8.4.3/share/doc/ghc-8.4.3/html/libraries' 'v p dyn'
@(src/Stack/Setup.hs:1097:54)
2018-10-11 15:26:57.334152: [debug] Installing library in /home/leon/.stack/programs/x86_64-linux/ghc-ncurses6-8.4.3/lib/ghc-8.4.3/integer-gmp-1.0.2.0
@(src/Stack/Setup.hs:1097:54)
2018-10-11 15:26:57.413044: [debug] "utils/ghc-cabal/dist-install/build/tmp/ghc-cabal-bindist" copy libraries/base dist-install "strip" '' '/home/leon/.stack/programs/x86_64-linux/ghc-ncurses6-8.4.3' '/home/leon/.stack/programs/x86_64-linux/ghc-ncurses6-8.4.3/lib/ghc-8.4.3' '/home/leon/.stack/programs/x86_64-linux/ghc-ncurses6-8.4.3/share/doc/ghc-8.4.3/html/libraries' 'v p dyn'
@(src/Stack/Setup.hs:1097:54)
2018-10-11 15:26:57.920002: [debug] Installing library in /home/leon/.stack/programs/x86_64-linux/ghc-ncurses6-8.4.3/lib/ghc-8.4.3/base-4.11.1.0
@(src/Stack/Setup.hs:1097:54)
2018-10-11 15:27:00.926094: [debug] "utils/ghc-cabal/dist-install/build/tmp/ghc-cabal-bindist" copy libraries/filepath dist-install "strip" '' '/home/leon/.stack/programs/x86_64-linux/ghc-ncurses6-8.4.3' '/home/leon/.stack/programs/x86_64-linux/ghc-ncurses6-8.4.3/lib/ghc-8.4.3' '/home/leon/.stack/programs/x86_64-linux/ghc-ncurses6-8.4.3/share/doc/ghc-8.4.3/html/libraries' 'v p dyn'
@(src/Stack/Setup.hs:1097:54)
2018-10-11 15:27:00.987405: [debug] Installing library in /home/leon/.stack/programs/x86_64-linux/ghc-ncurses6-8.4.3/lib/ghc-8.4.3/filepath-1.4.2
@(src/Stack/Setup.hs:1097:54)
2018-10-11 15:27:01.059077: [debug] "utils/ghc-cabal/dist-install/build/tmp/ghc-cabal-bindist" copy libraries/array dist-install "strip" '' '/home/leon/.stack/programs/x86_64-linux/ghc-ncurses6-8.4.3' '/home/leon/.stack/programs/x86_64-linux/ghc-ncurses6-8.4.3/lib/ghc-8.4.3' '/home/leon/.stack/programs/x86_64-linux/ghc-ncurses6-8.4.3/share/doc/ghc-8.4.3/html/libraries' 'v p dyn'
@(src/Stack/Setup.hs:1097:54)
2018-10-11 15:27:01.136624: [debug] Installing library in /home/leon/.stack/programs/x86_64-linux/ghc-ncurses6-8.4.3/lib/ghc-8.4.3/array-0.5.2.0
@(src/Stack/Setup.hs:1097:54)
2018-10-11 15:27:01.293924: [debug] "utils/ghc-cabal/dist-install/build/tmp/ghc-cabal-bindist" copy libraries/deepseq dist-install "strip" '' '/home/leon/.stack/programs/x86_64-linux/ghc-ncurses6-8.4.3' '/home/leon/.stack/programs/x86_64-linux/ghc-ncurses6-8.4.3/lib/ghc-8.4.3' '/home/leon/.stack/programs/x86_64-linux/ghc-ncurses6-8.4.3/share/doc/ghc-8.4.3/html/libraries' 'v p dyn'
@(src/Stack/Setup.hs:1097:54)
2018-10-11 15:27:01.347857: [debug] Installing library in /home/leon/.stack/programs/x86_64-linux/ghc-ncurses6-8.4.3/lib/ghc-8.4.3/deepseq-1.4.3.0
@(src/Stack/Setup.hs:1097:54)
2018-10-11 15:27:01.414289: [debug] "utils/ghc-cabal/dist-install/build/tmp/ghc-cabal-bindist" copy libraries/bytestring dist-install "strip" '' '/home/leon/.stack/programs/x86_64-linux/ghc-ncurses6-8.4.3' '/home/leon/.stack/programs/x86_64-linux/ghc-ncurses6-8.4.3/lib/ghc-8.4.3' '/home/leon/.stack/programs/x86_64-linux/ghc-ncurses6-8.4.3/share/doc/ghc-8.4.3/html/libraries' 'v p dyn'
@(src/Stack/Setup.hs:1097:54)
2018-10-11 15:27:01.528523: [debug] Installing library in /home/leon/.stack/programs/x86_64-linux/ghc-ncurses6-8.4.3/lib/ghc-8.4.3/bytestring-0.10.8.2
@(src/Stack/Setup.hs:1097:54)
2018-10-11 15:27:01.770035: [debug] "utils/ghc-cabal/dist-install/build/tmp/ghc-cabal-bindist" copy libraries/containers dist-install "strip" '' '/home/leon/.stack/programs/x86_64-linux/ghc-ncurses6-8.4.3' '/home/leon/.stack/programs/x86_64-linux/ghc-ncurses6-8.4.3/lib/ghc-8.4.3' '/home/leon/.stack/programs/x86_64-linux/ghc-ncurses6-8.4.3/share/doc/ghc-8.4.3/html/libraries' 'v p dyn'
@(src/Stack/Setup.hs:1097:54)
2018-10-11 15:27:01.945404: [debug] Installing library in /home/leon/.stack/programs/x86_64-linux/ghc-ncurses6-8.4.3/lib/ghc-8.4.3/containers-0.5.11.0
@(src/Stack/Setup.hs:1097:54)
2018-10-11 15:27:02.507452: [debug] "utils/ghc-cabal/dist-install/build/tmp/ghc-cabal-bindist" copy libraries/time dist-install "strip" '' '/home/leon/.stack/programs/x86_64-linux/ghc-ncurses6-8.4.3' '/home/leon/.stack/programs/x86_64-linux/ghc-ncurses6-8.4.3/lib/ghc-8.4.3' '/home/leon/.stack/programs/x86_64-linux/ghc-ncurses6-8.4.3/share/doc/ghc-8.4.3/html/libraries' 'v p dyn'
@(src/Stack/Setup.hs:1097:54)
2018-10-11 15:27:02.602152: [debug] Installing library in /home/leon/.stack/programs/x86_64-linux/ghc-ncurses6-8.4.3/lib/ghc-8.4.3/time-1.8.0.2
@(src/Stack/Setup.hs:1097:54)
2018-10-11 15:27:02.860019: [debug] "utils/ghc-cabal/dist-install/build/tmp/ghc-cabal-bindist" copy libraries/unix dist-install "strip" '' '/home/leon/.stack/programs/x86_64-linux/ghc-ncurses6-8.4.3' '/home/leon/.stack/programs/x86_64-linux/ghc-ncurses6-8.4.3/lib/ghc-8.4.3' '/home/leon/.stack/programs/x86_64-linux/ghc-ncurses6-8.4.3/share/doc/ghc-8.4.3/html/libraries' 'v p dyn'
@(src/Stack/Setup.hs:1097:54)
2018-10-11 15:27:02.958605: [debug] Installing library in /home/leon/.stack/programs/x86_64-linux/ghc-ncurses6-8.4.3/lib/ghc-8.4.3/unix-2.7.2.2
@(src/Stack/Setup.hs:1097:54)
2018-10-11 15:27:03.203178: [debug] "utils/ghc-cabal/dist-install/build/tmp/ghc-cabal-bindist" copy libraries/directory dist-install "strip" '' '/home/leon/.stack/programs/x86_64-linux/ghc-ncurses6-8.4.3' '/home/leon/.stack/programs/x86_64-linux/ghc-ncurses6-8.4.3/lib/ghc-8.4.3' '/home/leon/.stack/programs/x86_64-linux/ghc-ncurses6-8.4.3/share/doc/ghc-8.4.3/html/libraries' 'v p dyn'
@(src/Stack/Setup.hs:1097:54)
2018-10-11 15:27:03.288547: [debug] Installing library in /home/leon/.stack/programs/x86_64-linux/ghc-ncurses6-8.4.3/lib/ghc-8.4.3/directory-1.3.1.5
@(src/Stack/Setup.hs:1097:54)
2018-10-11 15:27:03.569079: [debug] "utils/ghc-cabal/dist-install/build/tmp/ghc-cabal-bindist" copy libraries/process dist-install "strip" '' '/home/leon/.stack/programs/x86_64-linux/ghc-ncurses6-8.4.3' '/home/leon/.stack/programs/x86_64-linux/ghc-ncurses6-8.4.3/lib/ghc-8.4.3' '/home/leon/.stack/programs/x86_64-linux/ghc-ncurses6-8.4.3/share/doc/ghc-8.4.3/html/libraries' 'v p dyn'
@(src/Stack/Setup.hs:1097:54)
2018-10-11 15:27:03.748248: [debug] Installing library in /home/leon/.stack/programs/x86_64-linux/ghc-ncurses6-8.4.3/lib/ghc-8.4.3/process-1.6.3.0
@(src/Stack/Setup.hs:1097:54)
2018-10-11 15:27:03.830729: [debug] "utils/ghc-cabal/dist-install/build/tmp/ghc-cabal-bindist" copy libraries/hpc dist-install "strip" '' '/home/leon/.stack/programs/x86_64-linux/ghc-ncurses6-8.4.3' '/home/leon/.stack/programs/x86_64-linux/ghc-ncurses6-8.4.3/lib/ghc-8.4.3' '/home/leon/.stack/programs/x86_64-linux/ghc-ncurses6-8.4.3/share/doc/ghc-8.4.3/html/libraries' 'v p dyn'
@(src/Stack/Setup.hs:1097:54)
2018-10-11 15:27:03.892300: [debug] Installing library in /home/leon/.stack/programs/x86_64-linux/ghc-ncurses6-8.4.3/lib/ghc-8.4.3/hpc-0.6.0.3
@(src/Stack/Setup.hs:1097:54)
2018-10-11 15:27:03.967381: [debug] "utils/ghc-cabal/dist-install/build/tmp/ghc-cabal-bindist" copy libraries/pretty dist-install "strip" '' '/home/leon/.stack/programs/x86_64-linux/ghc-ncurses6-8.4.3' '/home/leon/.stack/programs/x86_64-linux/ghc-ncurses6-8.4.3/lib/ghc-8.4.3' '/home/leon/.stack/programs/x86_64-linux/ghc-ncurses6-8.4.3/share/doc/ghc-8.4.3/html/libraries' 'v p dyn'
@(src/Stack/Setup.hs:1097:54)
2018-10-11 15:27:04.043343: [debug] Installing library in /home/leon/.stack/programs/x86_64-linux/ghc-ncurses6-8.4.3/lib/ghc-8.4.3/pretty-1.1.3.6
@(src/Stack/Setup.hs:1097:54)
2018-10-11 15:27:04.170688: [debug] "utils/ghc-cabal/dist-install/build/tmp/ghc-cabal-bindist" copy libraries/binary dist-install "strip" '' '/home/leon/.stack/programs/x86_64-linux/ghc-ncurses6-8.4.3' '/home/leon/.stack/programs/x86_64-linux/ghc-ncurses6-8.4.3/lib/ghc-8.4.3' '/home/leon/.stack/programs/x86_64-linux/ghc-ncurses6-8.4.3/share/doc/ghc-8.4.3/html/libraries' 'v p dyn'
@(src/Stack/Setup.hs:1097:54)
2018-10-11 15:27:04.245338: [debug] Installing library in /home/leon/.stack/programs/x86_64-linux/ghc-ncurses6-8.4.3/lib/ghc-8.4.3/binary-0.8.5.1
@(src/Stack/Setup.hs:1097:54)
2018-10-11 15:27:04.424864: [debug] "utils/ghc-cabal/dist-install/build/tmp/ghc-cabal-bindist" copy libraries/text dist-install "strip" '' '/home/leon/.stack/programs/x86_64-linux/ghc-ncurses6-8.4.3' '/home/leon/.stack/programs/x86_64-linux/ghc-ncurses6-8.4.3/lib/ghc-8.4.3' '/home/leon/.stack/programs/x86_64-linux/ghc-ncurses6-8.4.3/share/doc/ghc-8.4.3/html/libraries' 'v p dyn'
@(src/Stack/Setup.hs:1097:54)
2018-10-11 15:27:04.574989: [debug] Installing library in /home/leon/.stack/programs/x86_64-linux/ghc-ncurses6-8.4.3/lib/ghc-8.4.3/text-1.2.3.0
@(src/Stack/Setup.hs:1097:54)
2018-10-11 15:27:04.993708: [debug] "utils/ghc-cabal/dist-install/build/tmp/ghc-cabal-bindist" copy libraries/transformers dist-install "strip" '' '/home/leon/.stack/programs/x86_64-linux/ghc-ncurses6-8.4.3' '/home/leon/.stack/programs/x86_64-linux/ghc-ncurses6-8.4.3/lib/ghc-8.4.3' '/home/leon/.stack/programs/x86_64-linux/ghc-ncurses6-8.4.3/share/doc/ghc-8.4.3/html/libraries' 'v p dyn'
@(src/Stack/Setup.hs:1097:54)
2018-10-11 15:27:05.102435: [debug] Installing library in /home/leon/.stack/programs/x86_64-linux/ghc-ncurses6-8.4.3/lib/ghc-8.4.3/transformers-0.5.5.0
@(src/Stack/Setup.hs:1097:54)
2018-10-11 15:27:05.436045: [debug] "utils/ghc-cabal/dist-install/build/tmp/ghc-cabal-bindist" copy libraries/mtl dist-install "strip" '' '/home/leon/.stack/programs/x86_64-linux/ghc-ncurses6-8.4.3' '/home/leon/.stack/programs/x86_64-linux/ghc-ncurses6-8.4.3/lib/ghc-8.4.3' '/home/leon/.stack/programs/x86_64-linux/ghc-ncurses6-8.4.3/share/doc/ghc-8.4.3/html/libraries' 'v p dyn'
@(src/Stack/Setup.hs:1097:54)
2018-10-11 15:27:05.516852: [debug] Installing library in /home/leon/.stack/programs/x86_64-linux/ghc-ncurses6-8.4.3/lib/ghc-8.4.3/mtl-2.2.2
@(src/Stack/Setup.hs:1097:54)
2018-10-11 15:27:05.627290: [debug] "utils/ghc-cabal/dist-install/build/tmp/ghc-cabal-bindist" copy libraries/parsec dist-install "strip" '' '/home/leon/.stack/programs/x86_64-linux/ghc-ncurses6-8.4.3' '/home/leon/.stack/programs/x86_64-linux/ghc-ncurses6-8.4.3/lib/ghc-8.4.3' '/home/leon/.stack/programs/x86_64-linux/ghc-ncurses6-8.4.3/share/doc/ghc-8.4.3/html/libraries' 'v p dyn'
@(src/Stack/Setup.hs:1097:54)
2018-10-11 15:27:05.747071: [debug] Installing library in /home/leon/.stack/programs/x86_64-linux/ghc-ncurses6-8.4.3/lib/ghc-8.4.3/parsec-3.1.13.0
@(src/Stack/Setup.hs:1097:54)
2018-10-11 15:27:05.950980: [debug] "utils/ghc-cabal/dist-install/build/tmp/ghc-cabal-bindist" copy libraries/Cabal/Cabal dist-install "strip" '' '/home/leon/.stack/programs/x86_64-linux/ghc-ncurses6-8.4.3' '/home/leon/.stack/programs/x86_64-linux/ghc-ncurses6-8.4.3/lib/ghc-8.4.3' '/home/leon/.stack/programs/x86_64-linux/ghc-ncurses6-8.4.3/share/doc/ghc-8.4.3/html/libraries' 'v p dyn'
@(src/Stack/Setup.hs:1097:54)
2018-10-11 15:27:06.805787: [debug] Installing library in /home/leon/.stack/programs/x86_64-linux/ghc-ncurses6-8.4.3/lib/ghc-8.4.3/Cabal-2.2.0.1
@(src/Stack/Setup.hs:1097:54)
2018-10-11 15:27:13.007688: [debug] "utils/ghc-cabal/dist-install/build/tmp/ghc-cabal-bindist" copy libraries/ghc-boot-th dist-install "strip" '' '/home/leon/.stack/programs/x86_64-linux/ghc-ncurses6-8.4.3' '/home/leon/.stack/programs/x86_64-linux/ghc-ncurses6-8.4.3/lib/ghc-8.4.3' '/home/leon/.stack/programs/x86_64-linux/ghc-ncurses6-8.4.3/share/doc/ghc-8.4.3/html/libraries' 'v p dyn'
@(src/Stack/Setup.hs:1097:54)
2018-10-11 15:27:13.091856: [debug] Installing library in /home/leon/.stack/programs/x86_64-linux/ghc-ncurses6-8.4.3/lib/ghc-8.4.3/ghc-boot-th-8.4.3
@(src/Stack/Setup.hs:1097:54)
2018-10-11 15:27:13.214403: [debug] "utils/ghc-cabal/dist-install/build/tmp/ghc-cabal-bindist" copy libraries/ghc-boot dist-install "strip" '' '/home/leon/.stack/programs/x86_64-linux/ghc-ncurses6-8.4.3' '/home/leon/.stack/programs/x86_64-linux/ghc-ncurses6-8.4.3/lib/ghc-8.4.3' '/home/leon/.stack/programs/x86_64-linux/ghc-ncurses6-8.4.3/share/doc/ghc-8.4.3/html/libraries' 'v p dyn'
@(src/Stack/Setup.hs:1097:54)
2018-10-11 15:27:13.315579: [debug] Installing library in /home/leon/.stack/programs/x86_64-linux/ghc-ncurses6-8.4.3/lib/ghc-8.4.3/ghc-boot-8.4.3
@(src/Stack/Setup.hs:1097:54)
2018-10-11 15:27:13.481221: [debug] "utils/ghc-cabal/dist-install/build/tmp/ghc-cabal-bindist" copy libraries/template-haskell dist-install "strip" '' '/home/leon/.stack/programs/x86_64-linux/ghc-ncurses6-8.4.3' '/home/leon/.stack/programs/x86_64-linux/ghc-ncurses6-8.4.3/lib/ghc-8.4.3' '/home/leon/.stack/programs/x86_64-linux/ghc-ncurses6-8.4.3/share/doc/ghc-8.4.3/html/libraries' 'v p dyn'
@(src/Stack/Setup.hs:1097:54)
2018-10-11 15:27:13.583280: [debug] Installing library in /home/leon/.stack/programs/x86_64-linux/ghc-ncurses6-8.4.3/lib/ghc-8.4.3/template-haskell-2.13.0.0
@(src/Stack/Setup.hs:1097:54)
2018-10-11 15:27:14.361678: [debug] "utils/ghc-cabal/dist-install/build/tmp/ghc-cabal-bindist" copy libraries/ghc-compact dist-install "strip" '' '/home/leon/.stack/programs/x86_64-linux/ghc-ncurses6-8.4.3' '/home/leon/.stack/programs/x86_64-linux/ghc-ncurses6-8.4.3/lib/ghc-8.4.3' '/home/leon/.stack/programs/x86_64-linux/ghc-ncurses6-8.4.3/share/doc/ghc-8.4.3/html/libraries' 'v p dyn'
@(src/Stack/Setup.hs:1097:54)
2018-10-11 15:27:14.413153: [debug] Installing library in /home/leon/.stack/programs/x86_64-linux/ghc-ncurses6-8.4.3/lib/ghc-8.4.3/ghc-compact-0.1.0.0
@(src/Stack/Setup.hs:1097:54)
2018-10-11 15:27:14.454134: [debug] "utils/ghc-cabal/dist-install/build/tmp/ghc-cabal-bindist" copy libraries/xhtml dist-install "strip" '' '/home/leon/.stack/programs/x86_64-linux/ghc-ncurses6-8.4.3' '/home/leon/.stack/programs/x86_64-linux/ghc-ncurses6-8.4.3/lib/ghc-8.4.3' '/home/leon/.stack/programs/x86_64-linux/ghc-ncurses6-8.4.3/share/doc/ghc-8.4.3/html/libraries' 'v p dyn'
@(src/Stack/Setup.hs:1097:54)
2018-10-11 15:27:14.540412: [debug] Installing library in /home/leon/.stack/programs/x86_64-linux/ghc-ncurses6-8.4.3/lib/ghc-8.4.3/xhtml-3000.2.2.1
@(src/Stack/Setup.hs:1097:54)
2018-10-11 15:27:14.671330: [debug] "utils/ghc-cabal/dist-install/build/tmp/ghc-cabal-bindist" copy libraries/terminfo dist-install "strip" '' '/home/leon/.stack/programs/x86_64-linux/ghc-ncurses6-8.4.3' '/home/leon/.stack/programs/x86_64-linux/ghc-ncurses6-8.4.3/lib/ghc-8.4.3' '/home/leon/.stack/programs/x86_64-linux/ghc-ncurses6-8.4.3/share/doc/ghc-8.4.3/html/libraries' 'v p dyn'
@(src/Stack/Setup.hs:1097:54)
2018-10-11 15:27:14.740260: [debug] Installing library in /home/leon/.stack/programs/x86_64-linux/ghc-ncurses6-8.4.3/lib/ghc-8.4.3/terminfo-0.4.1.1
@(src/Stack/Setup.hs:1097:54)
2018-10-11 15:27:14.847893: [debug] "utils/ghc-cabal/dist-install/build/tmp/ghc-cabal-bindist" copy libraries/stm dist-install "strip" '' '/home/leon/.stack/programs/x86_64-linux/ghc-ncurses6-8.4.3' '/home/leon/.stack/programs/x86_64-linux/ghc-ncurses6-8.4.3/lib/ghc-8.4.3' '/home/leon/.stack/programs/x86_64-linux/ghc-ncurses6-8.4.3/share/doc/ghc-8.4.3/html/libraries' 'v p dyn'
@(src/Stack/Setup.hs:1097:54)
2018-10-11 15:27:14.912929: [debug] Installing library in /home/leon/.stack/programs/x86_64-linux/ghc-ncurses6-8.4.3/lib/ghc-8.4.3/stm-2.4.5.0
@(src/Stack/Setup.hs:1097:54)
2018-10-11 15:27:14.985167: [debug] "utils/ghc-cabal/dist-install/build/tmp/ghc-cabal-bindist" copy libraries/haskeline dist-install "strip" '' '/home/leon/.stack/programs/x86_64-linux/ghc-ncurses6-8.4.3' '/home/leon/.stack/programs/x86_64-linux/ghc-ncurses6-8.4.3/lib/ghc-8.4.3' '/home/leon/.stack/programs/x86_64-linux/ghc-ncurses6-8.4.3/share/doc/ghc-8.4.3/html/libraries' 'v p dyn'
@(src/Stack/Setup.hs:1097:54)
2018-10-11 15:27:15.094739: [debug] Installing library in /home/leon/.stack/programs/x86_64-linux/ghc-ncurses6-8.4.3/lib/ghc-8.4.3/haskeline-0.7.4.2
@(src/Stack/Setup.hs:1097:54)
2018-10-11 15:27:15.476277: [debug] "utils/ghc-cabal/dist-install/build/tmp/ghc-cabal-bindist" copy libraries/ghci dist-install "strip" '' '/home/leon/.stack/programs/x86_64-linux/ghc-ncurses6-8.4.3' '/home/leon/.stack/programs/x86_64-linux/ghc-ncurses6-8.4.3/lib/ghc-8.4.3' '/home/leon/.stack/programs/x86_64-linux/ghc-ncurses6-8.4.3/share/doc/ghc-8.4.3/html/libraries' 'v p dyn'
@(src/Stack/Setup.hs:1097:54)
2018-10-11 15:27:15.567172: [debug] Installing library in /home/leon/.stack/programs/x86_64-linux/ghc-ncurses6-8.4.3/lib/ghc-8.4.3/ghci-8.4.3
@(src/Stack/Setup.hs:1097:54)
2018-10-11 15:27:16.304422: [debug] "utils/ghc-cabal/dist-install/build/tmp/ghc-cabal-bindist" copy compiler stage2 "strip" '' '/home/leon/.stack/programs/x86_64-linux/ghc-ncurses6-8.4.3' '/home/leon/.stack/programs/x86_64-linux/ghc-ncurses6-8.4.3/lib/ghc-8.4.3' '/home/leon/.stack/programs/x86_64-linux/ghc-ncurses6-8.4.3/share/doc/ghc-8.4.3/html/libraries' 'v p dyn'
@(src/Stack/Setup.hs:1097:54)
2018-10-11 15:27:17.578958: [debug] Installing library in /home/leon/.stack/programs/x86_64-linux/ghc-ncurses6-8.4.3/lib/ghc-8.4.3/ghc-8.4.3
@(src/Stack/Setup.hs:1097:54)
2018-10-11 15:27:24.064090: [debug] "/home/leon/.stack/programs/x86_64-linux/ghc-ncurses6-8.4.3/lib/ghc-8.4.3/bin/ghc-pkg" --force --global-package-db "/home/leon/.stack/programs/x86_64-linux/ghc-ncurses6-8.4.3/lib/ghc-8.4.3/package.conf.d" update rts/dist/package.conf.install
@(src/Stack/Setup.hs:1097:54)
2018-10-11 15:27:24.106920: [debug] /home/leon/.stack/programs/x86_64-linux/ghc-ncurses6-8.4.3/lib/ghc-8.4.3/bin/ghc-pkg: error while loading shared libraries: libtinfo.so.6: cannot open shared object file: No such file or directory
@(src/Stack/Setup.hs:1097:54)
2018-10-11 15:27:24.108128: [debug] make[1]: *** [ghc.mk:1002: install_packages] Error 127
@(src/Stack/Setup.hs:1097:54)
2018-10-11 15:27:24.111684: [debug] make: *** [Makefile:51: install] Error 2
@(src/Stack/Setup.hs:1097:54)
Installing GHC ...
Received ExitFailure 2 when running
Raw command: /usr/bin/make install
Run from: /home/leon/.stack/programs/x86_64-linux/ghc-ncurses6-8.4.3.temp/ghc-8.4.3/

Advertisement

Disable Third Party Ads